MidnightBSD Magus

x11/nvidia-driver-304

NVidia graphics card binary drivers for hardware OpenGL rendering

Flavor Version Run OSVersion Arch License Restricted Status
304.137_9 481 2.2 amd64 nvidia 0 fail (Reset Port)

Events

Machine Type Time Message
m2264 info 2022-05-05 12:40:53.455778 Test Started
m2264 fail 2022-05-05 12:41:50.732987 make build returned non-zero: 1
m2264 fail 2022-05-05 12:41:50.78535 Test complete.

Log

===>  Building for nvidia-driver-304-304.137_9
--- all ---
===> src (all)
--- machine ---
--- x86 ---
--- objwarn ---
Warning: Object directory not changed from original /magus/work/usr/mports/x11/nvidia-driver-304/work/NVIDIA-FreeBSD-x86_64-304.137/src
--- machine ---
machine -> /usr/src/sys/amd64/include
--- x86 ---
x86 -> /usr/src/sys/x86/include
--- stdarg.h ---
--- vnode_if_newproto.h ---
--- vnode_if_typedef.h ---
--- opt_global.h ---
--- vnode_if_newproto.h ---
awk -f /usr/src/sys/tools/vnode_if.awk /usr/src/sys/kern/vnode_if.src -p
--- vnode_if_typedef.h ---
awk -f /usr/src/sys/tools/vnode_if.awk /usr/src/sys/kern/vnode_if.src -q
--- opt_global.h ---
:> opt_global.h
--- device_if.h ---
--- bus_if.h ---
--- device_if.h ---
awk -f /usr/src/sys/tools/makeobjops.awk /usr/src/sys/kern/device_if.m -h
--- bus_if.h ---
awk -f /usr/src/sys/tools/makeobjops.awk /usr/src/sys/kern/bus_if.m -h
--- pci_if.h ---
--- vnode_if.h ---
--- pci_if.h ---
awk -f /usr/src/sys/tools/makeobjops.awk /usr/src/sys/dev/pci/pci_if.m -h
--- vnode_if.h ---
awk -f /usr/src/sys/tools/vnode_if.awk /usr/src/sys/kern/vnode_if.src -h
--- nvidia_ctl.o ---
--- nvidia_dev.o ---
--- nvidia_i2c.o ---
--- nvidia_linux.o ---
--- nvidia_ctl.o ---
cc -O2 -pipe -fno-strict-aliasing -DNV_VERSION_STRING=\"304.137\" -D__KERNEL__ -DNVRM -Wno-unused-function -Wuninitialized -O -mno-red-zone -mcmodel=kernel -UDEBUG -U_DEBUG -DNDEBUG  -Werror -D_KERNEL -DKLD_MODULE -nostdinc  -I. -I. -I/usr/src/sys -fno-common  -fno-omit-frame-pointer -mno-omit-leaf-frame-pointer   -MD  -MF.depend.nvidia_ctl.o -MTnvidia_ctl.o -mcmodel=kernel -mno-red-zone -mno-mmx -mno-sse -msoft-float  -fno-asynchronous-unwind-tables -ffreestanding -fwrapv -fstack-protector -Wall -Wredundant-decls -Wnested-externs -Wstrict-prototypes -Wmissing-prototypes -Wpointer-arith -Winline -Wcast-qual -Wundef -Wno-pointer-sign -D__printf__=__freebsd_kprintf__ -Wmissing-include-dirs -fdiagnostics-show-option -Wno-unknown-pragmas -Wno-error=tautological-compare -Wno-error=empty-body -Wno-error=parentheses-equality -Wno-error=unused-function -Wno-error=pointer-sign -Wno-error=shift-negative-value -Wno-address-of-packed-member  -mno-aes -mno-avx  -std=iso9899:1999 -c nvidia_ctl.c -o nvidia_ctl.o
--- nvidia_dev.o ---
cc -O2 -pipe -fno-strict-aliasing -DNV_VERSION_STRING=\"304.137\" -D__KERNEL__ -DNVRM -Wno-unused-function -Wuninitialized -O -mno-red-zone -mcmodel=kernel -UDEBUG -U_DEBUG -DNDEBUG  -Werror -D_KERNEL -DKLD_MODULE -nostdinc  -I. -I. -I/usr/src/sys -fno-common  -fno-omit-frame-pointer -mno-omit-leaf-frame-pointer   -MD  -MF.depend.nvidia_dev.o -MTnvidia_dev.o -mcmodel=kernel -mno-red-zone -mno-mmx -mno-sse -msoft-float  -fno-asynchronous-unwind-tables -ffreestanding -fwrapv -fstack-protector -Wall -Wredundant-decls -Wnested-externs -Wstrict-prototypes -Wmissing-prototypes -Wpointer-arith -Winline -Wcast-qual -Wundef -Wno-pointer-sign -D__printf__=__freebsd_kprintf__ -Wmissing-include-dirs -fdiagnostics-show-option -Wno-unknown-pragmas -Wno-error=tautological-compare -Wno-error=empty-body -Wno-error=parentheses-equality -Wno-error=unused-function -Wno-error=pointer-sign -Wno-error=shift-negative-value -Wno-address-of-packed-member  -mno-aes -mno-avx  -std=iso9899:1999 -c nvidia_dev.c -o nvidia_dev.o
--- nvidia_i2c.o ---
cc -O2 -pipe -fno-strict-aliasing -DNV_VERSION_STRING=\"304.137\" -D__KERNEL__ -DNVRM -Wno-unused-function -Wuninitialized -O -mno-red-zone -mcmodel=kernel -UDEBUG -U_DEBUG -DNDEBUG  -Werror -D_KERNEL -DKLD_MODULE -nostdinc  -I. -I. -I/usr/src/sys -fno-common  -fno-omit-frame-pointer -mno-omit-leaf-frame-pointer   -MD  -MF.depend.nvidia_i2c.o -MTnvidia_i2c.o -mcmodel=kernel -mno-red-zone -mno-mmx -mno-sse -msoft-float  -fno-asynchronous-unwind-tables -ffreestanding -fwrapv -fstack-protector -Wall -Wredundant-decls -Wnested-externs -Wstrict-prototypes -Wmissing-prototypes -Wpointer-arith -Winline -Wcast-qual -Wundef -Wno-pointer-sign -D__printf__=__freebsd_kprintf__ -Wmissing-include-dirs -fdiagnostics-show-option -Wno-unknown-pragmas -Wno-error=tautological-compare -Wno-error=empty-body -Wno-error=parentheses-equality -Wno-error=unused-function -Wno-error=pointer-sign -Wno-error=shift-negative-value -Wno-address-of-packed-member  -mno-aes -mno-avx  -std=iso9899:1999 -c nvidia_i2c.c -o nvidia_i2c.o
--- nvidia_linux.o ---
cc -O2 -pipe -fno-strict-aliasing -DNV_VERSION_STRING=\"304.137\" -D__KERNEL__ -DNVRM -Wno-unused-function -Wuninitialized -O -mno-red-zone -mcmodel=kernel -UDEBUG -U_DEBUG -DNDEBUG  -Werror -D_KERNEL -DKLD_MODULE -nostdinc  -I. -I. -I/usr/src/sys -fno-common  -fno-omit-frame-pointer -mno-omit-leaf-frame-pointer   -MD  -MF.depend.nvidia_linux.o -MTnvidia_linux.o -mcmodel=kernel -mno-red-zone -mno-mmx -mno-sse -msoft-float  -fno-asynchronous-unwind-tables -ffreestanding -fwrapv -fstack-protector -Wall -Wredundant-decls -Wnested-externs -Wstrict-prototypes -Wmissing-prototypes -Wpointer-arith -Winline -Wcast-qual -Wundef -Wno-pointer-sign -D__printf__=__freebsd_kprintf__ -Wmissing-include-dirs -fdiagnostics-show-option -Wno-unknown-pragmas -Wno-error=tautological-compare -Wno-error=empty-body -Wno-error=parentheses-equality -Wno-error=unused-function -Wno-error=pointer-sign -Wno-error=shift-negative-value -Wno-address-of-packed-member  -mno-aes -mno-avx  -std=iso9899:1999 -c nvidia_linux.c -o nvidia_linux.o
--- nvidia_os.o ---
cc -O2 -pipe -fno-strict-aliasing -DNV_VERSION_STRING=\"304.137\" -D__KERNEL__ -DNVRM -Wno-unused-function -Wuninitialized -O -mno-red-zone -mcmodel=kernel -UDEBUG -U_DEBUG -DNDEBUG  -Werror -D_KERNEL -DKLD_MODULE -nostdinc  -I. -I. -I/usr/src/sys -fno-common  -fno-omit-frame-pointer -mno-omit-leaf-frame-pointer   -MD  -MF.depend.nvidia_os.o -MTnvidia_os.o -mcmodel=kernel -mno-red-zone -mno-mmx -mno-sse -msoft-float  -fno-asynchronous-unwind-tables -ffreestanding -fwrapv -fstack-protector -Wall -Wredundant-decls -Wnested-externs -Wstrict-prototypes -Wmissing-prototypes -Wpointer-arith -Winline -Wcast-qual -Wundef -Wno-pointer-sign -D__printf__=__freebsd_kprintf__ -Wmissing-include-dirs -fdiagnostics-show-option -Wno-unknown-pragmas -Wno-error=tautological-compare -Wno-error=empty-body -Wno-error=parentheses-equality -Wno-error=unused-function -Wno-error=pointer-sign -Wno-error=shift-negative-value -Wno-address-of-packed-member  -mno-aes -mno-avx  -std=iso9899:1999 -c nvidia_os.c -o nvidia_os.o
--- nvidia_os_pci.o ---
cc -O2 -pipe -fno-strict-aliasing -DNV_VERSION_STRING=\"304.137\" -D__KERNEL__ -DNVRM -Wno-unused-function -Wuninitialized -O -mno-red-zone -mcmodel=kernel -UDEBUG -U_DEBUG -DNDEBUG  -Werror -D_KERNEL -DKLD_MODULE -nostdinc  -I. -I. -I/usr/src/sys -fno-common  -fno-omit-frame-pointer -mno-omit-leaf-frame-pointer   -MD  -MF.depend.nvidia_os_pci.o -MTnvidia_os_pci.o -mcmodel=kernel -mno-red-zone -mno-mmx -mno-sse -msoft-float  -fno-asynchronous-unwind-tables -ffreestanding -fwrapv -fstack-protector -Wall -Wredundant-decls -Wnested-externs -Wstrict-prototypes -Wmissing-prototypes -Wpointer-arith -Winline -Wcast-qual -Wundef -Wno-pointer-sign -D__printf__=__freebsd_kprintf__ -Wmissing-include-dirs -fdiagnostics-show-option -Wno-unknown-pragmas -Wno-error=tautological-compare -Wno-error=empty-body -Wno-error=parentheses-equality -Wno-error=unused-function -Wno-error=pointer-sign -Wno-error=shift-negative-value -Wno-address-of-packed-member  -mno-aes -mno-avx  -std=iso9899:1999 -c nvidia_os_pci.c -o nvidia_os_pci.o--- nvidia_os_registry.o ---
cc -O2 -pipe -fno-strict-aliasing -DNV_VERSION_STRING=\"304.137\" -D__KERNEL__ -DNVRM -Wno-unused-function -Wuninitialized -O -mno-red-zone -mcmodel=kernel -UDEBUG -U_DEBUG -DNDEBUG  -Werror -D_KERNEL -DKLD_MODULE -nostdinc  -I. -I. -I/usr/src/sys -fno-common  -fno-omit-frame-pointer -mno-omit-leaf-frame-pointer   -MD  -MF.depend.nvidia_os_registry.o -MTnvidia_os_registry.o -mcmodel=kernel -mno-red-zone -mno-mmx -mno-sse -msoft-float  -fno-asynchronous-unwind-tables -ffreestanding -fwrapv -fstack-protector -Wall -Wredundant-decls -Wnested-externs -Wstrict-prototypes -Wmissing-prototypes -Wpointer-arith -Winline -Wcast-qual -Wundef -Wno-pointer-sign -D__printf__=__freebsd_kprintf__ -Wmissing-include-dirs -fdiagnostics-show-option -Wno-unknown-pragmas -Wno-error=tautological-compare -Wno-error=empty-body -Wno-error=parentheses-equality -Wno-error=unused-function -Wno-error=pointer-sign -Wno-error=shift-negative-value -Wno-address-of-packed-member  -mno-aes -mno-avx  -std=iso9899:1999 -c nvidia_os_registry.c -o nvidia_os_registry.o
--- nvidia_pci.o ---
cc -O2 -pipe -fno-strict-aliasing -DNV_VERSION_STRING=\"304.137\" -D__KERNEL__ -DNVRM -Wno-unused-function -Wuninitialized -O -mno-red-zone -mcmodel=kernel -UDEBUG -U_DEBUG -DNDEBUG  -Werror -D_KERNEL -DKLD_MODULE -nostdinc  -I. -I. -I/usr/src/sys -fno-common  -fno-omit-frame-pointer -mno-omit-leaf-frame-pointer   -MD  -MF.depend.nvidia_pci.o -MTnvidia_pci.o -mcmodel=kernel -mno-red-zone -mno-mmx -mno-sse -msoft-float  -fno-asynchronous-unwind-tables -ffreestanding -fwrapv -fstack-protector -Wall -Wredundant-decls -Wnested-externs -Wstrict-prototypes -Wmissing-prototypes -Wpointer-arith -Winline -Wcast-qual -Wundef -Wno-pointer-sign -D__printf__=__freebsd_kprintf__ -Wmissing-include-dirs -fdiagnostics-show-option -Wno-unknown-pragmas -Wno-error=tautological-compare -Wno-error=empty-body -Wno-error=parentheses-equality -Wno-error=unused-function -Wno-error=pointer-sign -Wno-error=shift-negative-value -Wno-address-of-packed-member  -mno-aes -mno-avx  -std=iso9899:1999 -c nvidia_pci.c -o nvidia_pci.o
--- nvidia_subr.o ---
cc -O2 -pipe -fno-strict-aliasing -DNV_VERSION_STRING=\"304.137\" -D__KERNEL__ -DNVRM -Wno-unused-function -Wuninitialized -O -mno-red-zone -mcmodel=kernel -UDEBUG -U_DEBUG -DNDEBUG  -Werror -D_KERNEL -DKLD_MODULE -nostdinc  -I. -I. -I/usr/src/sys -fno-common  -fno-omit-frame-pointer -mno-omit-leaf-frame-pointer   -MD  -MF.depend.nvidia_subr.o -MTnvidia_subr.o -mcmodel=kernel -mno-red-zone -mno-mmx -mno-sse -msoft-float  -fno-asynchronous-unwind-tables -ffreestanding -fwrapv -fstack-protector -Wall -Wredundant-decls -Wnested-externs -Wstrict-prototypes -Wmissing-prototypes -Wpointer-arith -Winline -Wcast-qual -Wundef -Wno-pointer-sign -D__printf__=__freebsd_kprintf__ -Wmissing-include-dirs -fdiagnostics-show-option -Wno-unknown-pragmas -Wno-error=tautological-compare -Wno-error=empty-body -Wno-error=parentheses-equality -Wno-error=unused-function -Wno-error=pointer-sign -Wno-error=shift-negative-value -Wno-address-of-packed-member  -mno-aes -mno-avx  -std=iso9899:1999 -c nvidia_subr.c -o nvidia_subr.o
--- nvidia_sysctl.o ---
cc -O2 -pipe -fno-strict-aliasing -DNV_VERSION_STRING=\"304.137\" -D__KERNEL__ -DNVRM -Wno-unused-function -Wuninitialized -O -mno-red-zone -mcmodel=kernel -UDEBUG -U_DEBUG -DNDEBUG  -Werror -D_KERNEL -DKLD_MODULE -nostdinc  -I. -I. -I/usr/src/sys -fno-common  -fno-omit-frame-pointer -mno-omit-leaf-frame-pointer   -MD  -MF.depend.nvidia_sysctl.o -MTnvidia_sysctl.o -mcmodel=kernel -mno-red-zone -mno-mmx -mno-sse -msoft-float  -fno-asynchronous-unwind-tables -ffreestanding -fwrapv -fstack-protector -Wall -Wredundant-decls -Wnested-externs -Wstrict-prototypes -Wmissing-prototypes -Wpointer-arith -Winline -Wcast-qual -Wundef -Wno-pointer-sign -D__printf__=__freebsd_kprintf__ -Wmissing-include-dirs -fdiagnostics-show-option -Wno-unknown-pragmas -Wno-error=tautological-compare -Wno-error=empty-body -Wno-error=parentheses-equality -Wno-error=unused-function -Wno-error=pointer-sign -Wno-error=shift-negative-value -Wno-address-of-packed-member  -mno-aes -mno-avx  -std=iso9899:1999 -c nvidia_sysctl.c -o nvidia_sysctl.o--- nvidia_subr.o ---
nvidia_subr.c:1219:45: error: too few arguments to function call, expected 8, have 7
            sc->dma_mask, PAGE_SIZE, 0, attr);
                                            ^
/usr/src/sys/vm/vm_extern.h:57:1: note: 'kmem_alloc_contig' declared here
vm_offset_t kmem_alloc_contig(struct vmem *, vm_size_t size, int flags,
^
nvidia_subr.c:1267:61: error: too few arguments to function call, expected 3, have 2
        kmem_free(at->pte_array[0].virtual_address, at->size);
        ~~~~~~~~~                                           ^
/usr/src/sys/vm/vm_extern.h:61:1: note: 'kmem_free' declared here
void kmem_free(struct vmem *, vm_offset_t, vm_size_t);
^
nvidia_subr.c:1293:57: error: too few arguments to function call, expected 3, have 2
    kmem_free(at->pte_array[0].virtual_address, at->size);
    ~~~~~~~~~                                           ^
/usr/src/sys/vm/vm_extern.h:61:1: note: 'kmem_free' declared here
void kmem_free(struct vmem *, vm_offset_t, vm_size_t);
^
nvidia_subr.c:1357:49: error: too few arguments to function call, expected 8, have 7
                sc->dma_mask, PAGE_SIZE, 0, attr);
                                                ^
/usr/src/sys/vm/vm_extern.h:57:1: note: 'kmem_alloc_contig' declared here
vm_offset_t kmem_alloc_contig(struct vmem *, vm_size_t size, int flags,
^
nvidia_subr.c:1410:62: error: too few arguments to function call, expected 3, have 2
        kmem_free(at->pte_array[i].virtual_address, PAGE_SIZE);
        ~~~~~~~~~                                            ^
/usr/src/sys/vm/vm_extern.h:61:1: note: 'kmem_free' declared here
void kmem_free(struct vmem *, vm_offset_t, vm_size_t);
^
nvidia_subr.c:1439:62: error: too few arguments to function call, expected 3, have 2
        kmem_free(at->pte_array[i].virtual_address, PAGE_SIZE);
        ~~~~~~~~~                                            ^
/usr/src/sys/vm/vm_extern.h:61:1: note: 'kmem_free' declared here
void kmem_free(struct vmem *, vm_offset_t, vm_size_t);
^
6 errors generated.
*** [nvidia_subr.o] Error code 1

make[2]: stopped in /magus/work/usr/mports/x11/nvidia-driver-304/work/NVIDIA-FreeBSD-x86_64-304.137/src
1 error

make[2]: stopped in /magus/work/usr/mports/x11/nvidia-driver-304/work/NVIDIA-FreeBSD-x86_64-304.137/src
*** [all] Error code 2

make[1]: stopped in /magus/work/usr/mports/x11/nvidia-driver-304/work/NVIDIA-FreeBSD-x86_64-304.137
1 error

make[1]: stopped in /magus/work/usr/mports/x11/nvidia-driver-304/work/NVIDIA-FreeBSD-x86_64-304.137
===> Compilation failed unexpectedly.
Try to set MAKE_JOBS_UNSAFE=yes and rebuild before reporting the failure to
the maintainer.
*** Error code 1

Stop.
make: stopped in /usr/mports/x11/nvidia-driver-304