MidnightBSD Magus

misc/wmcalendar

Dockable calendar with interface to iCalendar based calendars

Flavor Version Run OSVersion Arch License Restricted Status
0.5.2_3 333 0.8 i386 gpl2 0 fail

Events

Machine Type Time Message
Constellation info 2018-05-09 00:18:47.325685 Test Started
Constellation fail 2018-05-09 00:20:37.267689 make build returned non-zero: 1
Constellation fail 2018-05-09 00:20:37.404964 Test complete.

Log

===>  Building for wmcalendar-0.5.2_3
pkg-config: not found
pkg-config: not found
clang -O2 -pipe -fno-strict-aliasing -D`uname -s` -DHAVE_SYS_TIME_H -c wmCalendar.c -o wmCalendar.o -I/usr/local/include
clang -O2 -pipe -fno-strict-aliasing -D`uname -s` -DHAVE_SYS_TIME_H -c settings.c -o settings.o -I/usr/local/include
clang -O2 -pipe -fno-strict-aliasing -D`uname -s` -DHAVE_SYS_TIME_H -c dockapp.c -o dockapp.o -I/usr/local/include
In file included from wmCalendar.c:10:
In file included from ./wmCalendar.h:68:
./settings.h:2:10: fatal error: 'gtk/gtk.h' file not found
#include 
         ^
In file included from settings.c:1:
./settings.h:2:10: fatal error: 'gtk/gtk.h' file not found
#include 
         ^
1 error generated.
*** [settings.o] Error code 1
dockapp.c:62:2: warning: implicitly declaring library function 'exit' with type 'void (int) __attribute__((noreturn))'
        exit(1);
        ^
dockapp.c:62:2: note: please include the header  or explicitly provide a declaration for 'exit'
1 error generated.
*** [wmCalendar.o] Error code 1
1 warning generated.
2 errors
===> Compilation failed unexpectedly.
Try to set MAKE_JOBS_UNSAFE=yes and rebuild before reporting the failure to
the maintainer.
*** [do-build] Error code 1

Stop in /usr/mports/misc/wmcalendar.