MidnightBSD Magus

multimedia/gstreamer-plugins-ugly

Ugly gstreamer-plugins

Flavor Version Run OSVersion Arch License Restricted Status
0.10.19,3 300 0.6 amd64 gpl2 0 fail

Events

Machine Type Time Message
defiant info 2015-05-11 12:55:15.916922 Test Started
defiant fail 2015-05-11 12:59:17.326281 make build returned non-zero: 1
defiant fail 2015-05-11 12:59:17.427928 Test complete.

Log

===>  Building for gstreamer-plugins-ugly-0.10.19,3
/usr/local/bin/gmake -C asfdemux
gmake[1]: Entering directory '/magus/work/usr/mports/multimedia/gstreamer-plugins-ugly/work/gst-plugins-ugly-0.10.19/gst/asfdemux'
  CC     libgstasf_la-gstasfdemux.lo
  CC     libgstasf_la-gstasf.lo
  CC     libgstasf_la-asfheaders.lo
  CC     libgstasf_la-asfpacket.lo
asfpacket.c: In function 'gst_asf_demux_parse_payload':
asfpacket.c:39: warning: 'val' may be used uninitialized in this function
asfpacket.c:39: note: 'val' was declared here
asfpacket.c:39: warning: 'val' may be used uninitialized in this function
asfpacket.c:39: note: 'val' was declared here
asfpacket.c:39: warning: 'val' may be used uninitialized in this function
asfpacket.c:39: note: 'val' was declared here
asfpacket.c:39: warning: 'val' may be used uninitialized in this function
asfpacket.c:39: note: 'val' was declared here
asfpacket.c: In function 'gst_asf_demux_parse_packet':
asfpacket.c:39: warning: 'val' may be used uninitialized in this function
asfpacket.c:39: note: 'val' was declared here
asfpacket.c:39: warning: 'val' may be used uninitialized in this function
asfpacket.c:39: note: 'val' was declared here
asfpacket.c:39: warning: 'val' may be used uninitialized in this function
asfpacket.c:39: note: 'val' was declared here
  CC     libgstasf_la-gstrtpasfdepay.lo
  CC     libgstasf_la-gstrtspwms.lo
  CCLD   libgstasf.la
cc: /usr/local/lib/libgstriff-0.10.so: No such file or directory
cc: /usr/local/lib/libgstrtsp-0.10.so: No such file or directory
cc: /usr/local/lib/libgstsdp-0.10.so: No such file or directory
cc: /usr/local/lib/libgstrtp-0.10.so: No such file or directory
cc: /usr/local/lib/libgstaudio-0.10.so: No such file or directory
cc: /usr/local/lib/libgsttag-0.10.so: No such file or directory
Makefile:477: recipe for target 'libgstasf.la' failed
gmake[1]: *** [libgstasf.la] Error 1
gmake[1]: Leaving directory '/magus/work/usr/mports/multimedia/gstreamer-plugins-ugly/work/gst-plugins-ugly-0.10.19/gst/asfdemux'
Makefile:733: recipe for target 'asfdemux' failed
gmake: *** [asfdemux] Error 2
*** [do-build] Error code 2

Stop in /usr/mports/multimedia/gstreamer-plugins-ugly.