MidnightBSD Magus

multimedia/gstreamer-plugins-bad

Bad gstreamer-plugins

Flavor Version Run OSVersion Arch License Restricted Status
0.10.23_6,3 300 0.6 amd64 gpl2 0 fail

Events

Machine Type Time Message
defiant info 2015-05-11 12:50:47.111805 Test Started
defiant fail 2015-05-11 12:55:15.397455 make build returned non-zero: 1
defiant fail 2015-05-11 12:55:15.506989 Test complete.

Log

===>  Building for gstreamer-plugins-bad-0.10.23_6,3
Making all in gst
gmake[1]: Entering directory '/magus/work/usr/mports/multimedia/gstreamer-plugins-bad/work/gst-plugins-bad-0.10.23/gst-libs/gst'
Making all in interfaces
gmake[2]: Entering directory '/magus/work/usr/mports/multimedia/gstreamer-plugins-bad/work/gst-plugins-bad-0.10.23/gst-libs/gst/interfaces'
  GEN    photography-enumtypes.c
  GEN    photography-enumtypes.h
/usr/local/bin/gmake  all-am
gmake[3]: Entering directory '/magus/work/usr/mports/multimedia/gstreamer-plugins-bad/work/gst-plugins-bad-0.10.23/gst-libs/gst/interfaces'
  CC     libgstphotography_0.10_la-photography.lo
  CC     libgstphotography_0.10_la-photography-enumtypes.lo
  CCLD   libgstphotography-0.10.la
gmake[3]: Leaving directory '/magus/work/usr/mports/multimedia/gstreamer-plugins-bad/work/gst-plugins-bad-0.10.23/gst-libs/gst/interfaces'
gmake[2]: Leaving directory '/magus/work/usr/mports/multimedia/gstreamer-plugins-bad/work/gst-plugins-bad-0.10.23/gst-libs/gst/interfaces'
Making all in signalprocessor
gmake[2]: Entering directory '/magus/work/usr/mports/multimedia/gstreamer-plugins-bad/work/gst-plugins-bad-0.10.23/gst-libs/gst/signalprocessor'
  CC     libgstsignalprocessor_0.10_la-gstsignalprocessor.lo
  CCLD   libgstsignalprocessor-0.10.la
cc: /usr/local/lib/libgstaudio-0.10.so: No such file or directory
Makefile:644: recipe for target 'libgstsignalprocessor-0.10.la' failed
gmake[2]: *** [libgstsignalprocessor-0.10.la] Error 1
gmake[2]: Leaving directory '/magus/work/usr/mports/multimedia/gstreamer-plugins-bad/work/gst-plugins-bad-0.10.23/gst-libs/gst/signalprocessor'
Makefile:582: recipe for target 'all-recursive' failed
gmake[1]: *** [all-recursive] Error 1
gmake[1]: Leaving directory '/magus/work/usr/mports/multimedia/gstreamer-plugins-bad/work/gst-plugins-bad-0.10.23/gst-libs/gst'
Makefile:578: recipe for target 'all-recursive' failed
gmake: *** [all-recursive] Error 1
*** [do-build] Error code 2

Stop in /usr/mports/multimedia/gstreamer-plugins-bad.