MidnightBSD Magus

databases/postgresql84-client

PostgreSQL database (client)

Flavor Version Run OSVersion Arch License Restricted Status
8.4.12 284 0.6 amd64 mit 0 fail

Events

Machine Type Time Message
defiant info 2014-12-21 13:48:24.459442 Test Started
defiant fail 2014-12-21 13:49:16.566294 make build returned non-zero: 1
defiant fail 2014-12-21 13:49:16.653368 Test complete.

Log

===>  Building for postgresql-client-8.4.12
prereqdir=`cd parser/ >/dev/null && pwd` && \
  cd ../../src/include/parser/ && rm -f gram.h && \
  ln -s "$prereqdir/gram.h" .
/usr/local/bin/gmake -C utils fmgroids.h
gmake[1]: Entering directory '/magus/work/usr/mports/databases/postgresql84-client/work/postgresql-8.4.12/src/backend/utils'
AWK='/usr/bin/awk' /bin/sh Gen_fmgrtab.sh ../../../src/include/catalog/pg_proc.h
gmake[1]: Leaving directory '/magus/work/usr/mports/databases/postgresql84-client/work/postgresql-8.4.12/src/backend/utils'
cd ../../src/include/utils/ && rm -f fmgroids.h && \
    ln -s ../../../src/backend/utils/fmgroids.h .
/usr/local/bin/gmake -C utils probes.h
gmake[1]: Entering directory '/magus/work/usr/mports/databases/postgresql84-client/work/postgresql-8.4.12/src/backend/utils'
sed -f ./Gen_dummy_probes.sed probes.d >probes.h
gmake[1]: Leaving directory '/magus/work/usr/mports/databases/postgresql84-client/work/postgresql-8.4.12/src/backend/utils'
cd ../../src/include/utils/ && rm -f probes.h && \
    ln -s ../../../src/backend/utils/probes.h .
gmake: Nothing to be done for 'all'.
gmake: Nothing to be done for 'all'.
gmake[1]: Entering directory '/magus/work/usr/mports/databases/postgresql84-client/work/postgresql-8.4.12/src/interfaces/libpq'
msgfmt -o po/cs.mo po/cs.po
po/cs.po:24:39: invalid multibyte sequence
po/cs.po:24:40: invalid multibyte sequence
po/cs.po:24:42: invalid multibyte sequence
po/cs.po:24:43: invalid multibyte sequence
po/cs.po:24:48: invalid multibyte sequence
po/cs.po:24:49: invalid multibyte sequence
po/cs.po:29:35: invalid multibyte sequence
po/cs.po:29:36: invalid multibyte sequence
po/cs.po:34:31: invalid multibyte sequence
po/cs.po:34:32: invalid multibyte sequence
po/cs.po:34:34: invalid multibyte sequence
po/cs.po:34:35: invalid multibyte sequence
po/cs.po:34:38: invalid multibyte sequence
po/cs.po:34:39: invalid multibyte sequence
po/cs.po:38:10: invalid multibyte sequence
po/cs.po:38:11: invalid multibyte sequence
po/cs.po:38:16: invalid multibyte sequence
po/cs.po:38:17: invalid multibyte sequence
po/cs.po:38:21: invalid multibyte sequence
po/cs.po:38:22: invalid multibyte sequence
msgfmt: too many errors, aborting
../../../src/nls-global.mk:46: recipe for target 'po/cs.mo' failed
gmake[1]: *** [po/cs.mo] Error 1
gmake[1]: Leaving directory '/magus/work/usr/mports/databases/postgresql84-client/work/postgresql-8.4.12/src/interfaces/libpq'
Makefile:18: recipe for target 'all' failed
gmake: *** [all] Error 2
*** [do-build] Error code 2

Stop in /usr/mports/databases/postgresql84-client.