devel/glibmm26
C++ interfaces for glib2
| Flavor | Version | Run | OSVersion | Arch | License | Restricted | Build | Fetch | Test | Scan | |
|---|---|---|---|---|---|---|---|---|---|---|---|
| 2.90.0 | 648 | 4.1 | amd64 | lgpl2.1+ | 0 | fail | pass | untested | untested | Reset Port |
License Permissions: dist-mirror dist-sell pkg-mirror pkg-sell auto-accept
Events
| Machine | Phase | Type | Time | Message |
|---|---|---|---|---|
| m4164b | build | info | 2026-09-23 21:42:09.614329 | Build Started |
| m4164b | build | fail | 2026-09-23 21:43:35.368522 | make build returned non-zero: 1 |
| m4164b | build | fail | 2026-09-23 21:43:35.450013 | Build complete. |
| m4164b | fetch | info | 2026-09-20 19:56:51.729268 | Fetch Started |
| m4164b | fetch | pass | 2026-09-20 19:56:57.667929 | Fetch complete. |
Build Log
[1m===> Building for glibmm26-2.90.0[0m [ 0% 24/331] c++ -Iglib/glibmm/libglibmm-2.68.so.1.3.0.p -Iglib -I../glib -I../untracked/glib -I/usr/local/include/sigc++-3.0 -I/usr/local/lib/sigc++-3.0/include -I/usr/local/include/glib-2.0 -I/usr/local/lib/glib-2.0/include -I/usr/local/include -fdiagnostics-color=never -D_LIBCPP_HARDENING_MODE=_LIBCPP_HARDENING_MODE_FAST -D_FILE_OFFSET_BITS=64 -Wall -Winvalid-pch -std=c++17 -O2 -pipe -fstack-protector-strong -fno-strict-aliasing -fPIC -pthread -DGLIBMM_BUILD=1 -MD -MQ glib/glibmm/libglibmm-2.68.so.1.3.0.p/.._.._untracked_glib_glibmm_binding.cc.o -MF glib/glibmm/libglibmm-2.68.so.1.3.0.p/.._.._untracked_glib_glibmm_binding.cc.o.d -o glib/glibmm/libglibmm-2.68.so.1.3.0.p/.._.._untracked_glib_glibmm_binding.cc.o -c ../untracked/glib/glibmm/binding.cc FAILED: [code=1] glib/glibmm/libglibmm-2.68.so.1.3.0.p/.._.._untracked_glib_glibmm_binding.cc.o c++ -Iglib/glibmm/libglibmm-2.68.so.1.3.0.p -Iglib -I../glib -I../untracked/glib -I/usr/local/include/sigc++-3.0 -I/usr/local/lib/sigc++-3.0/include -I/usr/local/include/glib-2.0 -I/usr/local/lib/glib-2.0/include -I/usr/local/include -fdiagnostics-color=never -D_LIBCPP_HARDENING_MODE=_LIBCPP_HARDENING_MODE_FAST -D_FILE_OFFSET_BITS=64 -Wall -Winvalid-pch -std=c++17 -O2 -pipe -fstack-protector-strong -fno-strict-aliasing -fPIC -pthread -DGLIBMM_BUILD=1 -MD -MQ glib/glibmm/libglibmm-2.68.so.1.3.0.p/.._.._untracked_glib_glibmm_binding.cc.o -MF glib/glibmm/libglibmm-2.68.so.1.3.0.p/.._.._untracked_glib_glibmm_binding.cc.o.d -o glib/glibmm/libglibmm-2.68.so.1.3.0.p/.._.._untracked_glib_glibmm_binding.cc.o -c ../untracked/glib/glibmm/binding.cc In file included from ../untracked/glib/glibmm/binding.cc:4: In file included from ../glib/glibmm.h:104: In file included from ../untracked/glib/glibmm/binding.h:22: In file included from ../glib/glibmm/object.h:29: In file included from ../glib/glibmm/objectbase.h:22: In file included from ../glib/glibmm/signalproxy.h:27: /usr/local/include/sigc++-3.0/sigc++/sigc++.h:119:10: fatal error: 'sigc++/signal_connect.h' file not found 119 | #include| ^~~~~~~~~~~~~~~~~~~~~~~~~ 1 error generated. [ 0% 24/331] c++ -Iglib/glibmm/libglibmm-2.68.so.1.3.0.p -Iglib -I../glib -I../untracked/glib -I/usr/local/include/sigc++-3.0 -I/usr/local/lib/sigc++-3.0/include -I/usr/local/include/glib-2.0 -I/usr/local/lib/glib-2.0/include -I/usr/local/include -fdiagnostics-color=never -D_LIBCPP_HARDENING_MODE=_LIBCPP_HARDENING_MODE_FAST -D_FILE_OFFSET_BITS=64 -Wall -Winvalid-pch -std=c++17 -O2 -pipe -fstack-protector-strong -fno-strict-aliasing -fPIC -pthread -DGLIBMM_BUILD=1 -MD -MQ glib/glibmm/libglibmm-2.68.so.1.3.0.p/.._.._untracked_glib_glibmm_bytearray.cc.o -MF glib/glibmm/libglibmm-2.68.so.1.3.0.p/.._.._untracked_glib_glibmm_bytearray.cc.o.d -o glib/glibmm/libglibmm-2.68.so.1.3.0.p/.._.._untracked_glib_glibmm_bytearray.cc.o -c ../untracked/glib/glibmm/bytearray.cc FAILED: [code=1] glib/glibmm/libglibmm-2.68.so.1.3.0.p/.._.._untracked_glib_glibmm_bytearray.cc.o c++ -Iglib/glibmm/libglibmm-2.68.so.1.3.0.p -Iglib -I../glib -I../untracked/glib -I/usr/local/include/sigc++-3.0 -I/usr/local/lib/sigc++-3.0/include -I/usr/local/include/glib-2.0 -I/usr/local/lib/glib-2.0/include -I/usr/local/include -fdiagnostics-color=never -D_LIBCPP_HARDENING_MODE=_LIBCPP_HARDENING_MODE_FAST -D_FILE_OFFSET_BITS=64 -Wall -Winvalid-pch -std=c++17 -O2 -pipe -fstack-protector-strong -fno-strict-aliasing -fPIC -pthread -DGLIBMM_BUILD=1 -MD -MQ glib/glibmm/libglibmm-2.68.so.1.3.0.p/.._.._untracked_glib_glibmm_bytearray.cc.o -MF glib/glibmm/libglibmm-2.68.so.1.3.0.p/.._.._untracked_glib_glibmm_bytearray.cc.o.d -o glib/glibmm/libglibmm-2.68.so.1.3.0.p/.._.._untracked_glib_glibmm_bytearray.cc.o -c ../untracked/glib/glibmm/bytearray.cc In file included from ../untracked/glib/glibmm/bytearray.cc:4: In file included from ../glib/glibmm.h:104: In file included from ../untracked/glib/glibmm/binding.h:22: In file included from ../glib/glibmm/object.h:29: In file included from ../glib/glibmm/objectbase.h:22: In file included from ../glib/glibmm/signalproxy.h:27: /usr/local/include/sigc++-3.0/sigc++/sigc++.h:119:10: fatal error: 'sigc++/signal_connect.h' file not found 119 | #include | ^~~~~~~~~~~~~~~~~~~~~~~~~ 1 error generated. [ 0% 24/331] c++ -Iglib/glibmm/libglibmm-2.68.so.1.3.0.p -Iglib -I../glib -I../untracked/glib -I/usr/local/include/sigc++-3.0 -I/usr/local/lib/sigc++-3.0/include -I/usr/local/include/glib-2.0 -I/usr/local/lib/glib-2.0/include -I/usr/local/include -fdiagnostics-color=never -D_LIBCPP_HARDENING_MODE=_LIBCPP_HARDENING_MODE_FAST -D_FILE_OFFSET_BITS=64 -Wall -Winvalid-pch -std=c++17 -O2 -pipe -fstack-protector-strong -fno-strict-aliasing -fPIC -pthread -DGLIBMM_BUILD=1 -MD -MQ glib/glibmm/libglibmm-2.68.so.1.3.0.p/.._.._untracked_glib_glibmm_wrap_init.cc.o -MF glib/glibmm/libglibmm-2.68.so.1.3.0.p/.._.._untracked_glib_glibmm_wrap_init.cc.o.d -o glib/glibmm/libglibmm-2.68.so.1.3.0.p/.._.._untracked_glib_glibmm_wrap_init.cc.o -c ../untracked/glib/glibmm/wrap_init.cc FAILED: [code=1] glib/glibmm/libglibmm-2.68.so.1.3.0.p/.._.._untracked_glib_glibmm_wrap_init.cc.o c++ -Iglib/glibmm/libglibmm-2.68.so.1.3.0.p -Iglib -I../glib -I../untracked/glib -I/usr/local/include/sigc++-3.0 -I/usr/local/lib/sigc++-3.0/include -I/usr/local/include/glib-2.0 -I/usr/local/lib/glib-2.0/include -I/usr/local/include -fdiagnostics-color=never -D_LIBCPP_HARDENING_MODE=_LIBCPP_HARDENING_MODE_FAST -D_FILE_OFFSET_BITS=64 -Wall -Winvalid-pch -std=c++17 -O2 -pipe -fstack-protector-strong -fno-strict-aliasing -fPIC -pthread -DGLIBMM_BUILD=1 -MD -MQ glib/glibmm/libglibmm-2.68.so.1.3.0.p/.._.._untracked_glib_glibmm_wrap_init.cc.o -MF glib/glibmm/libglibmm-2.68.so.1.3.0.p/.._.._untracked_glib_glibmm_wrap_init.cc.o.d -o glib/glibmm/libglibmm-2.68.so.1.3.0.p/.._.._untracked_glib_glibmm_wrap_init.cc.o -c ../untracked/glib/glibmm/wrap_init.cc In file included from ../untracked/glib/glibmm/wrap_init.cc:4: In file included from ../glib/glibmm.h:106: In file included from ../untracked/glib/glibmm/bytearray.h:27: In file included from ../glib/glibmm/wrap.h:22: In file included from ../glib/glibmm/objectbase.h:22: In file included from ../glib/glibmm/signalproxy.h:27: /usr/local/include/sigc++-3.0/sigc++/sigc++.h:119:10: fatal error: 'sigc++/signal_connect.h' file not found 119 | #include | ^~~~~~~~~~~~~~~~~~~~~~~~~ 1 error generated. [ 1% 24/331] c++ -Iglib/glibmm/libglibmm-2.68.so.1.3.0.p -Iglib -I../glib -I../untracked/glib -I/usr/local/include/sigc++-3.0 -I/usr/local/lib/sigc++-3.0/include -I/usr/local/include/glib-2.0 -I/usr/local/lib/glib-2.0/include -I/usr/local/include -fdiagnostics-color=never -D_LIBCPP_HARDENING_MODE=_LIBCPP_HARDENING_MODE_FAST -D_FILE_OFFSET_BITS=64 -Wall -Winvalid-pch -std=c++17 -O2 -pipe -fstack-protector-strong -fno-strict-aliasing -fPIC -pthread -DGLIBMM_BUILD=1 -MD -MQ glib/glibmm/libglibmm-2.68.so.1.3.0.p/.._.._untracked_glib_glibmm_timezone.cc.o -MF glib/glibmm/libglibmm-2.68.so.1.3.0.p/.._.._untracked_glib_glibmm_timezone.cc.o.d -o glib/glibmm/libglibmm-2.68.so.1.3.0.p/.._.._untracked_glib_glibmm_timezone.cc.o -c ../untracked/glib/glibmm/timezone.cc FAILED: [code=1] glib/glibmm/libglibmm-2.68.so.1.3.0.p/.._.._untracked_glib_glibmm_timezone.cc.o c++ -Iglib/glibmm/libglibmm-2.68.so.1.3.0.p -Iglib -I../glib -I../untracked/glib -I/usr/local/include/sigc++-3.0 -I/usr/local/lib/sigc++-3.0/include -I/usr/local/include/glib-2.0 -I/usr/local/lib/glib-2.0/include -I/usr/local/include -fdiagnostics-color=never -D_LIBCPP_HARDENING_MODE=_LIBCPP_HARDENING_MODE_FAST -D_FILE_OFFSET_BITS=64 -Wall -Winvalid-pch -std=c++17 -O2 -pipe -fstack-protector-strong -fno-strict-aliasing -fPIC -pthread -DGLIBMM_BUILD=1 -MD -MQ glib/glibmm/libglibmm-2.68.so.1.3.0.p/.._.._untracked_glib_glibmm_timezone.cc.o -MF glib/glibmm/libglibmm-2.68.so.1.3.0.p/.._.._untracked_glib_glibmm_timezone.cc.o.d -o glib/glibmm/libglibmm-2.68.so.1.3.0.p/.._.._untracked_glib_glibmm_timezone.cc.o -c ../untracked/glib/glibmm/timezone.cc In file included from ../untracked/glib/glibmm/timezone.cc:4: In file included from ../glib/glibmm.h:104: In file included from ../untracked/glib/glibmm/binding.h:22: In file included from ../glib/glibmm/object.h:29: In file included from ../glib/glibmm/objectbase.h:22: In file included from ../glib/glibmm/signalproxy.h:27: /usr/local/include/sigc++-3.0/sigc++/sigc++.h:119:10: fatal error: 'sigc++/signal_connect.h' file not found 119 | #include | ^~~~~~~~~~~~~~~~~~~~~~~~~ 1 error generated. [ 1% 24/331] c++ -Iglib/glibmm/libglibmm-2.68.so.1.3.0.p -Iglib -I../glib -I../untracked/glib -I/usr/local/include/sigc++-3.0 -I/usr/local/lib/sigc++-3.0/include -I/usr/local/include/glib-2.0 -I/usr/local/lib/glib-2.0/include -I/usr/local/include -fdiagnostics-color=never -D_LIBCPP_HARDENING_MODE=_LIBCPP_HARDENING_MODE_FAST -D_FILE_OFFSET_BITS=64 -Wall -Winvalid-pch -std=c++17 -O2 -pipe -fstack-protector-strong -fno-strict-aliasing -fPIC -pthread -DGLIBMM_BUILD=1 -MD -MQ glib/glibmm/libglibmm-2.68.so.1.3.0.p/.._.._untracked_glib_glibmm_enums.cc.o -MF glib/glibmm/libglibmm-2.68.so.1.3.0.p/.._.._untracked_glib_glibmm_enums.cc.o.d -o glib/glibmm/libglibmm-2.68.so.1.3.0.p/.._.._untracked_glib_glibmm_enums.cc.o -c ../untracked/glib/glibmm/enums.cc FAILED: [code=1] glib/glibmm/libglibmm-2.68.so.1.3.0.p/.._.._untracked_glib_glibmm_enums.cc.o c++ -Iglib/glibmm/libglibmm-2.68.so.1.3.0.p -Iglib -I../glib -I../untracked/glib -I/usr/local/include/sigc++-3.0 -I/usr/local/lib/sigc++-3.0/include -I/usr/local/include/glib-2.0 -I/usr/local/lib/glib-2.0/include -I/usr/local/include -fdiagnostics-color=never -D_LIBCPP_HARDENING_MODE=_LIBCPP_HARDENING_MODE_FAST -D_FILE_OFFSET_BITS=64 -Wall -Winvalid-pch -std=c++17 -O2 -pipe -fstack-protector-strong -fno-strict-aliasing -fPIC -pthread -DGLIBMM_BUILD=1 -MD -MQ glib/glibmm/libglibmm-2.68.so.1.3.0.p/.._.._untracked_glib_glibmm_enums.cc.o -MF glib/glibmm/libglibmm-2.68.so.1.3.0.p/.._.._untracked_glib_glibmm_enums.cc.o.d -o glib/glibmm/libglibmm-2.68.so.1.3.0.p/.._.._untracked_glib_glibmm_enums.cc.o -c ../untracked/glib/glibmm/enums.cc In file included from ../untracked/glib/glibmm/enums.cc:4: In file included from ../glib/glibmm.h:104: In file included from ../untracked/glib/glibmm/binding.h:22: In file included from ../glib/glibmm/object.h:29: In file included from ../glib/glibmm/objectbase.h:22: In file included from ../glib/glibmm/signalproxy.h:27: /usr/local/include/sigc++-3.0/sigc++/sigc++.h:119:10: fatal error: 'sigc++/signal_connect.h' file not found 119 | #include | ^~~~~~~~~~~~~~~~~~~~~~~~~ 1 error generated. [ 1% 24/331] c++ -Iglib/glibmm/libglibmm-2.68.so.1.3.0.p -Iglib -I../glib -I../untracked/glib -I/usr/local/include/sigc++-3.0 -I/usr/local/lib/sigc++-3.0/include -I/usr/local/include/glib-2.0 -I/usr/local/lib/glib-2.0/include -I/usr/local/include -fdiagnostics-color=never -D_LIBCPP_HARDENING_MODE=_LIBCPP_HARDENING_MODE_FAST -D_FILE_OFFSET_BITS=64 -Wall -Winvalid-pch -std=c++17 -O2 -pipe -fstack-protector-strong -fno-strict-aliasing -fPIC -pthread -DGLIBMM_BUILD=1 -MD -MQ glib/glibmm/libglibmm-2.68.so.1.3.0.p/.._.._untracked_glib_glibmm_iochannel.cc.o -MF glib/glibmm/libglibmm-2.68.so.1.3.0.p/.._.._untracked_glib_glibmm_iochannel.cc.o.d -o glib/glibmm/libglibmm-2.68.so.1.3.0.p/.._.._untracked_glib_glibmm_iochannel.cc.o -c ../untracked/glib/glibmm/iochannel.cc FAILED: [code=1] glib/glibmm/libglibmm-2.68.so.1.3.0.p/.._.._untracked_glib_glibmm_iochannel.cc.o c++ -Iglib/glibmm/libglibmm-2.68.so.1.3.0.p -Iglib -I../glib -I../untracked/glib -I/usr/local/include/sigc++-3.0 -I/usr/local/lib/sigc++-3.0/include -I/usr/local/include/glib-2.0 -I/usr/local/lib/glib-2.0/include -I/usr/local/include -fdiagnostics-color=never -D_LIBCPP_HARDENING_MODE=_LIBCPP_HARDENING_MODE_FAST -D_FILE_OFFSET_BITS=64 -Wall -Winvalid-pch -std=c++17 -O2 -pipe -fstack-protector-strong -fno-strict-aliasing -fPIC -pthread -DGLIBMM_BUILD=1 -MD -MQ glib/glibmm/libglibmm-2.68.so.1.3.0.p/.._.._untracked_glib_glibmm_iochannel.cc.o -MF glib/glibmm/libglibmm-2.68.so.1.3.0.p/.._.._untracked_glib_glibmm_iochannel.cc.o.d -o glib/glibmm/libglibmm-2.68.so.1.3.0.p/.._.._untracked_glib_glibmm_iochannel.cc.o -c ../untracked/glib/glibmm/iochannel.cc In file included from ../untracked/glib/glibmm/iochannel.cc:4: In file included from ../glib/glibmm.h:104: In file included from ../untracked/glib/glibmm/binding.h:22: In file included from ../glib/glibmm/object.h:29: In file included from ../glib/glibmm/objectbase.h:22: In file included from ../glib/glibmm/signalproxy.h:27: /usr/local/include/sigc++-3.0/sigc++/sigc++.h:119:10: fatal error: 'sigc++/signal_connect.h' file not found 119 | #include | ^~~~~~~~~~~~~~~~~~~~~~~~~ 1 error generated. [ 2% 24/331] c++ -Iglib/glibmm/libglibmm-2.68.so.1.3.0.p -Iglib -I../glib -I../untracked/glib -I/usr/local/include/sigc++-3.0 -I/usr/local/lib/sigc++-3.0/include -I/usr/local/include/glib-2.0 -I/usr/local/lib/glib-2.0/include -I/usr/local/include -fdiagnostics-color=never -D_LIBCPP_HARDENING_MODE=_LIBCPP_HARDENING_MODE_FAST -D_FILE_OFFSET_BITS=64 -Wall -Winvalid-pch -std=c++17 -O2 -pipe -fstack-protector-strong -fno-strict-aliasing -fPIC -pthread -DGLIBMM_BUILD=1 -MD -MQ glib/glibmm/libglibmm-2.68.so.1.3.0.p/.._.._untracked_glib_glibmm_convert.cc.o -MF glib/glibmm/libglibmm-2.68.so.1.3.0.p/.._.._untracked_glib_glibmm_convert.cc.o.d -o glib/glibmm/libglibmm-2.68.so.1.3.0.p/.._.._untracked_glib_glibmm_convert.cc.o -c ../untracked/glib/glibmm/convert.cc FAILED: [code=1] glib/glibmm/libglibmm-2.68.so.1.3.0.p/.._.._untracked_glib_glibmm_convert.cc.o c++ -Iglib/glibmm/libglibmm-2.68.so.1.3.0.p -Iglib -I../glib -I../untracked/glib -I/usr/local/include/sigc++-3.0 -I/usr/local/lib/sigc++-3.0/include -I/usr/local/include/glib-2.0 -I/usr/local/lib/glib-2.0/include -I/usr/local/include -fdiagnostics-color=never -D_LIBCPP_HARDENING_MODE=_LIBCPP_HARDENING_MODE_FAST -D_FILE_OFFSET_BITS=64 -Wall -Winvalid-pch -std=c++17 -O2 -pipe -fstack-protector-strong -fno-strict-aliasing -fPIC -pthread -DGLIBMM_BUILD=1 -MD -MQ glib/glibmm/libglibmm-2.68.so.1.3.0.p/.._.._untracked_glib_glibmm_convert.cc.o -MF glib/glibmm/libglibmm-2.68.so.1.3.0.p/.._.._untracked_glib_glibmm_convert.cc.o.d -o glib/glibmm/libglibmm-2.68.so.1.3.0.p/.._.._untracked_glib_glibmm_convert.cc.o -c ../untracked/glib/glibmm/convert.cc In file included from ../untracked/glib/glibmm/convert.cc:4: In file included from ../glib/glibmm.h:104: In file included from ../untracked/glib/glibmm/binding.h:22: In file included from ../glib/glibmm/object.h:29: In file included from ../glib/glibmm/objectbase.h:22: In file included from ../glib/glibmm/signalproxy.h:27: /usr/local/include/sigc++-3.0/sigc++/sigc++.h:119:10: fatal error: 'sigc++/signal_connect.h' file not found 119 | #include | ^~~~~~~~~~~~~~~~~~~~~~~~~ 1 error generated. [ 2% 24/331] c++ -Iglib/glibmm/libglibmm-2.68.so.1.3.0.p -Iglib -I../glib -I../untracked/glib -I/usr/local/include/sigc++-3.0 -I/usr/local/lib/sigc++-3.0/include -I/usr/local/include/glib-2.0 -I/usr/local/lib/glib-2.0/include -I/usr/local/include -fdiagnostics-color=never -D_LIBCPP_HARDENING_MODE=_LIBCPP_HARDENING_MODE_FAST -D_FILE_OFFSET_BITS=64 -Wall -Winvalid-pch -std=c++17 -O2 -pipe -fstack-protector-strong -fno-strict-aliasing -fPIC -pthread -DGLIBMM_BUILD=1 -MD -MQ glib/glibmm/libglibmm-2.68.so.1.3.0.p/.._.._untracked_glib_glibmm_keyfile.cc.o -MF glib/glibmm/libglibmm-2.68.so.1.3.0.p/.._.._untracked_glib_glibmm_keyfile.cc.o.d -o glib/glibmm/libglibmm-2.68.so.1.3.0.p/.._.._untracked_glib_glibmm_keyfile.cc.o -c ../untracked/glib/glibmm/keyfile.cc FAILED: [code=1] glib/glibmm/libglibmm-2.68.so.1.3.0.p/.._.._untracked_glib_glibmm_keyfile.cc.o c++ -Iglib/glibmm/libglibmm-2.68.so.1.3.0.p -Iglib -I../glib -I../untracked/glib -I/usr/local/include/sigc++-3.0 -I/usr/local/lib/sigc++-3.0/include -I/usr/local/include/glib-2.0 -I/usr/local/lib/glib-2.0/include -I/usr/local/include -fdiagnostics-color=never -D_LIBCPP_HARDENING_MODE=_LIBCPP_HARDENING_MODE_FAST -D_FILE_OFFSET_BITS=64 -Wall -Winvalid-pch -std=c++17 -O2 -pipe -fstack-protector-strong -fno-strict-aliasing -fPIC -pthread -DGLIBMM_BUILD=1 -MD -MQ glib/glibmm/libglibmm-2.68.so.1.3.0.p/.._.._untracked_glib_glibmm_keyfile.cc.o -MF glib/glibmm/libglibmm-2.68.so.1.3.0.p/.._.._untracked_glib_glibmm_keyfile.cc.o.d -o glib/glibmm/libglibmm-2.68.so.1.3.0.p/.._.._untracked_glib_glibmm_keyfile.cc.o -c ../untracked/glib/glibmm/keyfile.cc In file included from ../untracked/glib/glibmm/keyfile.cc:4: In file included from ../glib/glibmm.h:104: In file included from ../untracked/glib/glibmm/binding.h:22: In file included from ../glib/glibmm/object.h:29: In file included from ../glib/glibmm/objectbase.h:22: In file included from ../glib/glibmm/signalproxy.h:27: /usr/local/include/sigc++-3.0/sigc++/sigc++.h:119:10: fatal error: 'sigc++/signal_connect.h' file not found 119 | #include | ^~~~~~~~~~~~~~~~~~~~~~~~~ 1 error generated. [ 2% 24/331] c++ -Iglib/glibmm/libglibmm-2.68.so.1.3.0.p -Iglib -I../glib -I../untracked/glib -I/usr/local/include/sigc++-3.0 -I/usr/local/lib/sigc++-3.0/include -I/usr/local/include/glib-2.0 -I/usr/local/lib/glib-2.0/include -I/usr/local/include -fdiagnostics-color=never -D_LIBCPP_HARDENING_MODE=_LIBCPP_HARDENING_MODE_FAST -D_FILE_OFFSET_BITS=64 -Wall -Winvalid-pch -std=c++17 -O2 -pipe -fstack-protector-strong -fno-strict-aliasing -fPIC -pthread -DGLIBMM_BUILD=1 -MD -MQ glib/glibmm/libglibmm-2.68.so.1.3.0.p/.._.._untracked_glib_glibmm_optiongroup.cc.o -MF glib/glibmm/libglibmm-2.68.so.1.3.0.p/.._.._untracked_glib_glibmm_optiongroup.cc.o.d -o glib/glibmm/libglibmm-2.68.so.1.3.0.p/.._.._untracked_glib_glibmm_optiongroup.cc.o -c ../untracked/glib/glibmm/optiongroup.cc FAILED: [code=1] glib/glibmm/libglibmm-2.68.so.1.3.0.p/.._.._untracked_glib_glibmm_optiongroup.cc.o c++ -Iglib/glibmm/libglibmm-2.68.so.1.3.0.p -Iglib -I../glib -I../untracked/glib -I/usr/local/include/sigc++-3.0 -I/usr/local/lib/sigc++-3.0/include -I/usr/local/include/glib-2.0 -I/usr/local/lib/glib-2.0/include -I/usr/local/include -fdiagnostics-color=never -D_LIBCPP_HARDENING_MODE=_LIBCPP_HARDENING_MODE_FAST -D_FILE_OFFSET_BITS=64 -Wall -Winvalid-pch -std=c++17 -O2 -pipe -fstack-protector-strong -fno-strict-aliasing -fPIC -pthread -DGLIBMM_BUILD=1 -MD -MQ glib/glibmm/libglibmm-2.68.so.1.3.0.p/.._.._untracked_glib_glibmm_optiongroup.cc.o -MF glib/glibmm/libglibmm-2.68.so.1.3.0.p/.._.._untracked_glib_glibmm_optiongroup.cc.o.d -o glib/glibmm/libglibmm-2.68.so.1.3.0.p/.._.._untracked_glib_glibmm_optiongroup.cc.o -c ../untracked/glib/glibmm/optiongroup.cc In file included from ../untracked/glib/glibmm/optiongroup.cc:4: In file included from ../glib/glibmm.h:104: In file included from ../untracked/glib/glibmm/binding.h:22: In file included from ../glib/glibmm/object.h:29: In file included from ../glib/glibmm/objectbase.h:22: In file included from ../glib/glibmm/signalproxy.h:27: /usr/local/include/sigc++-3.0/sigc++/sigc++.h:119:10: fatal error: 'sigc++/signal_connect.h' file not found 119 | #include | ^~~~~~~~~~~~~~~~~~~~~~~~~ 1 error generated. [ 3% 24/331] c++ -Iglib/glibmm/libglibmm-2.68.so.1.3.0.p -Iglib -I../glib -I../untracked/glib -I/usr/local/include/sigc++-3.0 -I/usr/local/lib/sigc++-3.0/include -I/usr/local/include/glib-2.0 -I/usr/local/lib/glib-2.0/include -I/usr/local/include -fdiagnostics-color=never -D_LIBCPP_HARDENING_MODE=_LIBCPP_HARDENING_MODE_FAST -D_FILE_OFFSET_BITS=64 -Wall -Winvalid-pch -std=c++17 -O2 -pipe -fstack-protector-strong -fno-strict-aliasing -fPIC -pthread -DGLIBMM_BUILD=1 -MD -MQ glib/glibmm/libglibmm-2.68.so.1.3.0.p/.._.._untracked_glib_glibmm_bytes.cc.o -MF glib/glibmm/libglibmm-2.68.so.1.3.0.p/.._.._untracked_glib_glibmm_bytes.cc.o.d -o glib/glibmm/libglibmm-2.68.so.1.3.0.p/.._.._untracked_glib_glibmm_bytes.cc.o -c ../untracked/glib/glibmm/bytes.cc FAILED: [code=1] glib/glibmm/libglibmm-2.68.so.1.3.0.p/.._.._untracked_glib_glibmm_bytes.cc.o c++ -Iglib/glibmm/libglibmm-2.68.so.1.3.0.p -Iglib -I../glib -I../untracked/glib -I/usr/local/include/sigc++-3.0 -I/usr/local/lib/sigc++-3.0/include -I/usr/local/include/glib-2.0 -I/usr/local/lib/glib-2.0/include -I/usr/local/include -fdiagnostics-color=never -D_LIBCPP_HARDENING_MODE=_LIBCPP_HARDENING_MODE_FAST -D_FILE_OFFSET_BITS=64 -Wall -Winvalid-pch -std=c++17 -O2 -pipe -fstack-protector-strong -fno-strict-aliasing -fPIC -pthread -DGLIBMM_BUILD=1 -MD -MQ glib/glibmm/libglibmm-2.68.so.1.3.0.p/.._.._untracked_glib_glibmm_bytes.cc.o -MF glib/glibmm/libglibmm-2.68.so.1.3.0.p/.._.._untracked_glib_glibmm_bytes.cc.o.d -o glib/glibmm/libglibmm-2.68.so.1.3.0.p/.._.._untracked_glib_glibmm_bytes.cc.o -c ../untracked/glib/glibmm/bytes.cc In file included from ../untracked/glib/glibmm/bytes.cc:4: In file included from ../glib/glibmm.h:104: In file included from ../untracked/glib/glibmm/binding.h:22: In file included from ../glib/glibmm/object.h:29: In file included from ../glib/glibmm/objectbase.h:22: In file included from ../glib/glibmm/signalproxy.h:27: /usr/local/include/sigc++-3.0/sigc++/sigc++.h:119:10: fatal error: 'sigc++/signal_connect.h' file not found 119 | #include | ^~~~~~~~~~~~~~~~~~~~~~~~~ 1 error generated. [ 3% 24/331] c++ -Iglib/glibmm/libglibmm-2.68.so.1.3.0.p -Iglib -I../glib -I../untracked/glib -I/usr/local/include/sigc++-3.0 -I/usr/local/lib/sigc++-3.0/include -I/usr/local/include/glib-2.0 -I/usr/local/lib/glib-2.0/include -I/usr/local/include -fdiagnostics-color=never -D_LIBCPP_HARDENING_MODE=_LIBCPP_HARDENING_MODE_FAST -D_FILE_OFFSET_BITS=64 -Wall -Winvalid-pch -std=c++17 -O2 -pipe -fstack-protector-strong -fno-strict-aliasing -fPIC -pthread -DGLIBMM_BUILD=1 -MD -MQ glib/glibmm/libglibmm-2.68.so.1.3.0.p/.._.._untracked_glib_glibmm_optionentry.cc.o -MF glib/glibmm/libglibmm-2.68.so.1.3.0.p/.._.._untracked_glib_glibmm_optionentry.cc.o.d -o glib/glibmm/libglibmm-2.68.so.1.3.0.p/.._.._untracked_glib_glibmm_optionentry.cc.o -c ../untracked/glib/glibmm/optionentry.cc FAILED: [code=1] glib/glibmm/libglibmm-2.68.so.1.3.0.p/.._.._untracked_glib_glibmm_optionentry.cc.o c++ -Iglib/glibmm/libglibmm-2.68.so.1.3.0.p -Iglib -I../glib -I../untracked/glib -I/usr/local/include/sigc++-3.0 -I/usr/local/lib/sigc++-3.0/include -I/usr/local/include/glib-2.0 -I/usr/local/lib/glib-2.0/include -I/usr/local/include -fdiagnostics-color=never -D_LIBCPP_HARDENING_MODE=_LIBCPP_HARDENING_MODE_FAST -D_FILE_OFFSET_BITS=64 -Wall -Winvalid-pch -std=c++17 -O2 -pipe -fstack-protector-strong -fno-strict-aliasing -fPIC -pthread -DGLIBMM_BUILD=1 -MD -MQ glib/glibmm/libglibmm-2.68.so.1.3.0.p/.._.._untracked_glib_glibmm_optionentry.cc.o -MF glib/glibmm/libglibmm-2.68.so.1.3.0.p/.._.._untracked_glib_glibmm_optionentry.cc.o.d -o glib/glibmm/libglibmm-2.68.so.1.3.0.p/.._.._untracked_glib_glibmm_optionentry.cc.o -c ../untracked/glib/glibmm/optionentry.cc In file included from ../untracked/glib/glibmm/optionentry.cc:4: In file included from ../glib/glibmm.h:104: In file included from ../untracked/glib/glibmm/binding.h:22: In file included from ../glib/glibmm/object.h:29: In file included from ../glib/glibmm/objectbase.h:22: In file included from ../glib/glibmm/signalproxy.h:27: /usr/local/include/sigc++-3.0/sigc++/sigc++.h:119:10: fatal error: 'sigc++/signal_connect.h' file not found 119 | #include | ^~~~~~~~~~~~~~~~~~~~~~~~~ 1 error generated. [ 3% 24/331] c++ -Iglib/glibmm/libglibmm-2.68.so.1.3.0.p -Iglib -I../glib -I../untracked/glib -I/usr/local/include/sigc++-3.0 -I/usr/local/lib/sigc++-3.0/include -I/usr/local/include/glib-2.0 -I/usr/local/lib/glib-2.0/include -I/usr/local/include -fdiagnostics-color=never -D_LIBCPP_HARDENING_MODE=_LIBCPP_HARDENING_MODE_FAST -D_FILE_OFFSET_BITS=64 -Wall -Winvalid-pch -std=c++17 -O2 -pipe -fstack-protector-strong -fno-strict-aliasing -fPIC -pthread -DGLIBMM_BUILD=1 -MD -MQ glib/glibmm/libglibmm-2.68.so.1.3.0.p/.._.._untracked_glib_glibmm_optioncontext.cc.o -MF glib/glibmm/libglibmm-2.68.so.1.3.0.p/.._.._untracked_glib_glibmm_optioncontext.cc.o.d -o glib/glibmm/libglibmm-2.68.so.1.3.0.p/.._.._untracked_glib_glibmm_optioncontext.cc.o -c ../untracked/glib/glibmm/optioncontext.cc FAILED: [code=1] glib/glibmm/libglibmm-2.68.so.1.3.0.p/.._.._untracked_glib_glibmm_optioncontext.cc.o c++ -Iglib/glibmm/libglibmm-2.68.so.1.3.0.p -Iglib -I../glib -I../untracked/glib -I/usr/local/include/sigc++-3.0 -I/usr/local/lib/sigc++-3.0/include -I/usr/local/include/glib-2.0 -I/usr/local/lib/glib-2.0/include -I/usr/local/include -fdiagnostics-color=never -D_LIBCPP_HARDENING_MODE=_LIBCPP_HARDENING_MODE_FAST -D_FILE_OFFSET_BITS=64 -Wall -Winvalid-pch -std=c++17 -O2 -pipe -fstack-protector-strong -fno-strict-aliasing -fPIC -pthread -DGLIBMM_BUILD=1 -MD -MQ glib/glibmm/libglibmm-2.68.so.1.3.0.p/.._.._untracked_glib_glibmm_optioncontext.cc.o -MF glib/glibmm/libglibmm-2.68.so.1.3.0.p/.._.._untracked_glib_glibmm_optioncontext.cc.o.d -o glib/glibmm/libglibmm-2.68.so.1.3.0.p/.._.._untracked_glib_glibmm_optioncontext.cc.o -c ../untracked/glib/glibmm/optioncontext.cc In file included from ../untracked/glib/glibmm/optioncontext.cc:4: In file included from ../glib/glibmm.h:104: In file included from ../untracked/glib/glibmm/binding.h:22: In file included from ../glib/glibmm/object.h:29: In file included from ../glib/glibmm/objectbase.h:22: In file included from ../glib/glibmm/signalproxy.h:27: /usr/local/include/sigc++-3.0/sigc++/sigc++.h:119:10: fatal error: 'sigc++/signal_connect.h' file not found 119 | #include | ^~~~~~~~~~~~~~~~~~~~~~~~~ 1 error generated. [ 3% 24/331] c++ -Iglib/glibmm/libglibmm-2.68.so.1.3.0.p -Iglib -I../glib -I../untracked/glib -I/usr/local/include/sigc++-3.0 -I/usr/local/lib/sigc++-3.0/include -I/usr/local/include/glib-2.0 -I/usr/local/lib/glib-2.0/include -I/usr/local/include -fdiagnostics-color=never -D_LIBCPP_HARDENING_MODE=_LIBCPP_HARDENING_MODE_FAST -D_FILE_OFFSET_BITS=64 -Wall -Winvalid-pch -std=c++17 -O2 -pipe -fstack-protector-strong -fno-strict-aliasing -fPIC -pthread -DGLIBMM_BUILD=1 -MD -MQ glib/glibmm/libglibmm-2.68.so.1.3.0.p/.._.._untracked_glib_glibmm_module.cc.o -MF glib/glibmm/libglibmm-2.68.so.1.3.0.p/.._.._untracked_glib_glibmm_module.cc.o.d -o glib/glibmm/libglibmm-2.68.so.1.3.0.p/.._.._untracked_glib_glibmm_module.cc.o -c ../untracked/glib/glibmm/module.cc FAILED: [code=1] glib/glibmm/libglibmm-2.68.so.1.3.0.p/.._.._untracked_glib_glibmm_module.cc.o c++ -Iglib/glibmm/libglibmm-2.68.so.1.3.0.p -Iglib -I../glib -I../untracked/glib -I/usr/local/include/sigc++-3.0 -I/usr/local/lib/sigc++-3.0/include -I/usr/local/include/glib-2.0 -I/usr/local/lib/glib-2.0/include -I/usr/local/include -fdiagnostics-color=never -D_LIBCPP_HARDENING_MODE=_LIBCPP_HARDENING_MODE_FAST -D_FILE_OFFSET_BITS=64 -Wall -Winvalid-pch -std=c++17 -O2 -pipe -fstack-protector-strong -fno-strict-aliasing -fPIC -pthread -DGLIBMM_BUILD=1 -MD -MQ glib/glibmm/libglibmm-2.68.so.1.3.0.p/.._.._untracked_glib_glibmm_module.cc.o -MF glib/glibmm/libglibmm-2.68.so.1.3.0.p/.._.._untracked_glib_glibmm_module.cc.o.d -o glib/glibmm/libglibmm-2.68.so.1.3.0.p/.._.._untracked_glib_glibmm_module.cc.o -c ../untracked/glib/glibmm/module.cc In file included from ../untracked/glib/glibmm/module.cc:4: In file included from ../glib/glibmm.h:104: In file included from ../untracked/glib/glibmm/binding.h:22: In file included from ../glib/glibmm/object.h:29: In file included from ../glib/glibmm/objectbase.h:22: In file included from ../glib/glibmm/signalproxy.h:27: /usr/local/include/sigc++-3.0/sigc++/sigc++.h:119:10: fatal error: 'sigc++/signal_connect.h' file not found 119 | #include | ^~~~~~~~~~~~~~~~~~~~~~~~~ 1 error generated. [ 4% 24/331] c++ -Iglib/glibmm/libglibmm-2.68.so.1.3.0.p -Iglib -I../glib -I../untracked/glib -I/usr/local/include/sigc++-3.0 -I/usr/local/lib/sigc++-3.0/include -I/usr/local/include/glib-2.0 -I/usr/local/lib/glib-2.0/include -I/usr/local/include -fdiagnostics-color=never -D_LIBCPP_HARDENING_MODE=_LIBCPP_HARDENING_MODE_FAST -D_FILE_OFFSET_BITS=64 -Wall -Winvalid-pch -std=c++17 -O2 -pipe -fstack-protector-strong -fno-strict-aliasing -fPIC -pthread -DGLIBMM_BUILD=1 -MD -MQ glib/glibmm/libglibmm-2.68.so.1.3.0.p/.._.._untracked_glib_glibmm_date.cc.o -MF glib/glibmm/libglibmm-2.68.so.1.3.0.p/.._.._untracked_glib_glibmm_date.cc.o.d -o glib/glibmm/libglibmm-2.68.so.1.3.0.p/.._.._untracked_glib_glibmm_date.cc.o -c ../untracked/glib/glibmm/date.cc FAILED: [code=1] glib/glibmm/libglibmm-2.68.so.1.3.0.p/.._.._untracked_glib_glibmm_date.cc.o c++ -Iglib/glibmm/libglibmm-2.68.so.1.3.0.p -Iglib -I../glib -I../untracked/glib -I/usr/local/include/sigc++-3.0 -I/usr/local/lib/sigc++-3.0/include -I/usr/local/include/glib-2.0 -I/usr/local/lib/glib-2.0/include -I/usr/local/include -fdiagnostics-color=never -D_LIBCPP_HARDENING_MODE=_LIBCPP_HARDENING_MODE_FAST -D_FILE_OFFSET_BITS=64 -Wall -Winvalid-pch -std=c++17 -O2 -pipe -fstack-protector-strong -fno-strict-aliasing -fPIC -pthread -DGLIBMM_BUILD=1 -MD -MQ glib/glibmm/libglibmm-2.68.so.1.3.0.p/.._.._untracked_glib_glibmm_date.cc.o -MF glib/glibmm/libglibmm-2.68.so.1.3.0.p/.._.._untracked_glib_glibmm_date.cc.o.d -o glib/glibmm/libglibmm-2.68.so.1.3.0.p/.._.._untracked_glib_glibmm_date.cc.o -c ../untracked/glib/glibmm/date.cc In file included from ../untracked/glib/glibmm/date.cc:4: In file included from ../glib/glibmm.h:104: In file included from ../untracked/glib/glibmm/binding.h:22: In file included from ../glib/glibmm/object.h:29: In file included from ../glib/glibmm/objectbase.h:22: In file included from ../glib/glibmm/signalproxy.h:27: /usr/local/include/sigc++-3.0/sigc++/sigc++.h:119:10: fatal error: 'sigc++/signal_connect.h' file not found 119 | #include | ^~~~~~~~~~~~~~~~~~~~~~~~~ 1 error generated. [ 4% 24/331] c++ -Iglib/glibmm/libglibmm-2.68.so.1.3.0.p -Iglib -I../glib -I../untracked/glib -I/usr/local/include/sigc++-3.0 -I/usr/local/lib/sigc++-3.0/include -I/usr/local/include/glib-2.0 -I/usr/local/lib/glib-2.0/include -I/usr/local/include -fdiagnostics-color=never -D_LIBCPP_HARDENING_MODE=_LIBCPP_HARDENING_MODE_FAST -D_FILE_OFFSET_BITS=64 -Wall -Winvalid-pch -std=c++17 -O2 -pipe -fstack-protector-strong -fno-strict-aliasing -fPIC -pthread -DGLIBMM_BUILD=1 -MD -MQ glib/glibmm/libglibmm-2.68.so.1.3.0.p/.._.._untracked_glib_glibmm_spawn.cc.o -MF glib/glibmm/libglibmm-2.68.so.1.3.0.p/.._.._untracked_glib_glibmm_spawn.cc.o.d -o glib/glibmm/libglibmm-2.68.so.1.3.0.p/.._.._untracked_glib_glibmm_spawn.cc.o -c ../untracked/glib/glibmm/spawn.cc FAILED: [code=1] glib/glibmm/libglibmm-2.68.so.1.3.0.p/.._.._untracked_glib_glibmm_spawn.cc.o c++ -Iglib/glibmm/libglibmm-2.68.so.1.3.0.p -Iglib -I../glib -I../untracked/glib -I/usr/local/include/sigc++-3.0 -I/usr/local/lib/sigc++-3.0/include -I/usr/local/include/glib-2.0 -I/usr/local/lib/glib-2.0/include -I/usr/local/include -fdiagnostics-color=never -D_LIBCPP_HARDENING_MODE=_LIBCPP_HARDENING_MODE_FAST -D_FILE_OFFSET_BITS=64 -Wall -Winvalid-pch -std=c++17 -O2 -pipe -fstack-protector-strong -fno-strict-aliasing -fPIC -pthread -DGLIBMM_BUILD=1 -MD -MQ glib/glibmm/libglibmm-2.68.so.1.3.0.p/.._.._untracked_glib_glibmm_spawn.cc.o -MF glib/glibmm/libglibmm-2.68.so.1.3.0.p/.._.._untracked_glib_glibmm_spawn.cc.o.d -o glib/glibmm/libglibmm-2.68.so.1.3.0.p/.._.._untracked_glib_glibmm_spawn.cc.o -c ../untracked/glib/glibmm/spawn.cc In file included from ../untracked/glib/glibmm/spawn.cc:4: In file included from ../glib/glibmm.h:104: In file included from ../untracked/glib/glibmm/binding.h:22: In file included from ../glib/glibmm/object.h:29: In file included from ../glib/glibmm/objectbase.h:22: In file included from ../glib/glibmm/signalproxy.h:27: /usr/local/include/sigc++-3.0/sigc++/sigc++.h:119:10: fatal error: 'sigc++/signal_connect.h' file not found 119 | #include | ^~~~~~~~~~~~~~~~~~~~~~~~~ 1 error generated. [ 4% 24/331] c++ -Iglib/glibmm/libglibmm-2.68.so.1.3.0.p -Iglib -I../glib -I../untracked/glib -I/usr/local/include/sigc++-3.0 -I/usr/local/lib/sigc++-3.0/include -I/usr/local/include/glib-2.0 -I/usr/local/lib/glib-2.0/include -I/usr/local/include -fdiagnostics-color=never -D_LIBCPP_HARDENING_MODE=_LIBCPP_HARDENING_MODE_FAST -D_FILE_OFFSET_BITS=64 -Wall -Winvalid-pch -std=c++17 -O2 -pipe -fstack-protector-strong -fno-strict-aliasing -fPIC -pthread -DGLIBMM_BUILD=1 -MD -MQ glib/glibmm/libglibmm-2.68.so.1.3.0.p/.._.._untracked_glib_glibmm_datetime.cc.o -MF glib/glibmm/libglibmm-2.68.so.1.3.0.p/.._.._untracked_glib_glibmm_datetime.cc.o.d -o glib/glibmm/libglibmm-2.68.so.1.3.0.p/.._.._untracked_glib_glibmm_datetime.cc.o -c ../untracked/glib/glibmm/datetime.cc FAILED: [code=1] glib/glibmm/libglibmm-2.68.so.1.3.0.p/.._.._untracked_glib_glibmm_datetime.cc.o c++ -Iglib/glibmm/libglibmm-2.68.so.1.3.0.p -Iglib -I../glib -I../untracked/glib -I/usr/local/include/sigc++-3.0 -I/usr/local/lib/sigc++-3.0/include -I/usr/local/include/glib-2.0 -I/usr/local/lib/glib-2.0/include -I/usr/local/include -fdiagnostics-color=never -D_LIBCPP_HARDENING_MODE=_LIBCPP_HARDENING_MODE_FAST -D_FILE_OFFSET_BITS=64 -Wall -Winvalid-pch -std=c++17 -O2 -pipe -fstack-protector-strong -fno-strict-aliasing -fPIC -pthread -DGLIBMM_BUILD=1 -MD -MQ glib/glibmm/libglibmm-2.68.so.1.3.0.p/.._.._untracked_glib_glibmm_datetime.cc.o -MF glib/glibmm/libglibmm-2.68.so.1.3.0.p/.._.._untracked_glib_glibmm_datetime.cc.o.d -o glib/glibmm/libglibmm-2.68.so.1.3.0.p/.._.._untracked_glib_glibmm_datetime.cc.o -c ../untracked/glib/glibmm/datetime.cc In file included from ../untracked/glib/glibmm/datetime.cc:4: In file included from ../glib/glibmm.h:104: In file included from ../untracked/glib/glibmm/binding.h:22: In file included from ../glib/glibmm/object.h:29: In file included from ../glib/glibmm/objectbase.h:22: In file included from ../glib/glibmm/signalproxy.h:27: /usr/local/include/sigc++-3.0/sigc++/sigc++.h:119:10: fatal error: 'sigc++/signal_connect.h' file not found 119 | #include | ^~~~~~~~~~~~~~~~~~~~~~~~~ 1 error generated. [ 5% 24/331] c++ -Iglib/glibmm/libglibmm-2.68.so.1.3.0.p -Iglib -I../glib -I../untracked/glib -I/usr/local/include/sigc++-3.0 -I/usr/local/lib/sigc++-3.0/include -I/usr/local/include/glib-2.0 -I/usr/local/lib/glib-2.0/include -I/usr/local/include -fdiagnostics-color=never -D_LIBCPP_HARDENING_MODE=_LIBCPP_HARDENING_MODE_FAST -D_FILE_OFFSET_BITS=64 -Wall -Winvalid-pch -std=c++17 -O2 -pipe -fstack-protector-strong -fno-strict-aliasing -fPIC -pthread -DGLIBMM_BUILD=1 -MD -MQ glib/glibmm/libglibmm-2.68.so.1.3.0.p/.._.._untracked_glib_glibmm_regex.cc.o -MF glib/glibmm/libglibmm-2.68.so.1.3.0.p/.._.._untracked_glib_glibmm_regex.cc.o.d -o glib/glibmm/libglibmm-2.68.so.1.3.0.p/.._.._untracked_glib_glibmm_regex.cc.o -c ../untracked/glib/glibmm/regex.cc FAILED: [code=1] glib/glibmm/libglibmm-2.68.so.1.3.0.p/.._.._untracked_glib_glibmm_regex.cc.o c++ -Iglib/glibmm/libglibmm-2.68.so.1.3.0.p -Iglib -I../glib -I../untracked/glib -I/usr/local/include/sigc++-3.0 -I/usr/local/lib/sigc++-3.0/include -I/usr/local/include/glib-2.0 -I/usr/local/lib/glib-2.0/include -I/usr/local/include -fdiagnostics-color=never -D_LIBCPP_HARDENING_MODE=_LIBCPP_HARDENING_MODE_FAST -D_FILE_OFFSET_BITS=64 -Wall -Winvalid-pch -std=c++17 -O2 -pipe -fstack-protector-strong -fno-strict-aliasing -fPIC -pthread -DGLIBMM_BUILD=1 -MD -MQ glib/glibmm/libglibmm-2.68.so.1.3.0.p/.._.._untracked_glib_glibmm_regex.cc.o -MF glib/glibmm/libglibmm-2.68.so.1.3.0.p/.._.._untracked_glib_glibmm_regex.cc.o.d -o glib/glibmm/libglibmm-2.68.so.1.3.0.p/.._.._untracked_glib_glibmm_regex.cc.o -c ../untracked/glib/glibmm/regex.cc In file included from ../untracked/glib/glibmm/regex.cc:4: In file included from ../glib/glibmm.h:104: In file included from ../untracked/glib/glibmm/binding.h:22: In file included from ../glib/glibmm/object.h:29: In file included from ../glib/glibmm/objectbase.h:22: In file included from ../glib/glibmm/signalproxy.h:27: /usr/local/include/sigc++-3.0/sigc++/sigc++.h:119:10: fatal error: 'sigc++/signal_connect.h' file not found 119 | #include | ^~~~~~~~~~~~~~~~~~~~~~~~~ 1 error generated. [ 5% 24/331] c++ -Iglib/glibmm/libglibmm-2.68.so.1.3.0.p -Iglib -I../glib -I../untracked/glib -I/usr/local/include/sigc++-3.0 -I/usr/local/lib/sigc++-3.0/include -I/usr/local/include/glib-2.0 -I/usr/local/lib/glib-2.0/include -I/usr/local/include -fdiagnostics-color=never -D_LIBCPP_HARDENING_MODE=_LIBCPP_HARDENING_MODE_FAST -D_FILE_OFFSET_BITS=64 -Wall -Winvalid-pch -std=c++17 -O2 -pipe -fstack-protector-strong -fno-strict-aliasing -fPIC -pthread -DGLIBMM_BUILD=1 -MD -MQ glib/glibmm/libglibmm-2.68.so.1.3.0.p/.._.._untracked_glib_glibmm_checksum.cc.o -MF glib/glibmm/libglibmm-2.68.so.1.3.0.p/.._.._untracked_glib_glibmm_checksum.cc.o.d -o glib/glibmm/libglibmm-2.68.so.1.3.0.p/.._.._untracked_glib_glibmm_checksum.cc.o -c ../untracked/glib/glibmm/checksum.cc FAILED: [code=1] glib/glibmm/libglibmm-2.68.so.1.3.0.p/.._.._untracked_glib_glibmm_checksum.cc.o c++ -Iglib/glibmm/libglibmm-2.68.so.1.3.0.p -Iglib -I../glib -I../untracked/glib -I/usr/local/include/sigc++-3.0 -I/usr/local/lib/sigc++-3.0/include -I/usr/local/include/glib-2.0 -I/usr/local/lib/glib-2.0/include -I/usr/local/include -fdiagnostics-color=never -D_LIBCPP_HARDENING_MODE=_LIBCPP_HARDENING_MODE_FAST -D_FILE_OFFSET_BITS=64 -Wall -Winvalid-pch -std=c++17 -O2 -pipe -fstack-protector-strong -fno-strict-aliasing -fPIC -pthread -DGLIBMM_BUILD=1 -MD -MQ glib/glibmm/libglibmm-2.68.so.1.3.0.p/.._.._untracked_glib_glibmm_checksum.cc.o -MF glib/glibmm/libglibmm-2.68.so.1.3.0.p/.._.._untracked_glib_glibmm_checksum.cc.o.d -o glib/glibmm/libglibmm-2.68.so.1.3.0.p/.._.._untracked_glib_glibmm_checksum.cc.o -c ../untracked/glib/glibmm/checksum.cc In file included from ../untracked/glib/glibmm/checksum.cc:4: In file included from ../glib/glibmm.h:104: In file included from ../untracked/glib/glibmm/binding.h:22: In file included from ../glib/glibmm/object.h:29: In file included from ../glib/glibmm/objectbase.h:22: In file included from ../glib/glibmm/signalproxy.h:27: /usr/local/include/sigc++-3.0/sigc++/sigc++.h:119:10: fatal error: 'sigc++/signal_connect.h' file not found 119 | #include | ^~~~~~~~~~~~~~~~~~~~~~~~~ 1 error generated. [ 5% 24/331] c++ -Iglib/glibmm/libglibmm-2.68.so.1.3.0.p -Iglib -I../glib -I../untracked/glib -I/usr/local/include/sigc++-3.0 -I/usr/local/lib/sigc++-3.0/include -I/usr/local/include/glib-2.0 -I/usr/local/lib/glib-2.0/include -I/usr/local/include -fdiagnostics-color=never -D_LIBCPP_HARDENING_MODE=_LIBCPP_HARDENING_MODE_FAST -D_FILE_OFFSET_BITS=64 -Wall -Winvalid-pch -std=c++17 -O2 -pipe -fstack-protector-strong -fno-strict-aliasing -fPIC -pthread -DGLIBMM_BUILD=1 -MD -MQ glib/glibmm/libglibmm-2.68.so.1.3.0.p/.._.._untracked_glib_glibmm_shell.cc.o -MF glib/glibmm/libglibmm-2.68.so.1.3.0.p/.._.._untracked_glib_glibmm_shell.cc.o.d -o glib/glibmm/libglibmm-2.68.so.1.3.0.p/.._.._untracked_glib_glibmm_shell.cc.o -c ../untracked/glib/glibmm/shell.cc FAILED: [code=1] glib/glibmm/libglibmm-2.68.so.1.3.0.p/.._.._untracked_glib_glibmm_shell.cc.o c++ -Iglib/glibmm/libglibmm-2.68.so.1.3.0.p -Iglib -I../glib -I../untracked/glib -I/usr/local/include/sigc++-3.0 -I/usr/local/lib/sigc++-3.0/include -I/usr/local/include/glib-2.0 -I/usr/local/lib/glib-2.0/include -I/usr/local/include -fdiagnostics-color=never -D_LIBCPP_HARDENING_MODE=_LIBCPP_HARDENING_MODE_FAST -D_FILE_OFFSET_BITS=64 -Wall -Winvalid-pch -std=c++17 -O2 -pipe -fstack-protector-strong -fno-strict-aliasing -fPIC -pthread -DGLIBMM_BUILD=1 -MD -MQ glib/glibmm/libglibmm-2.68.so.1.3.0.p/.._.._untracked_glib_glibmm_shell.cc.o -MF glib/glibmm/libglibmm-2.68.so.1.3.0.p/.._.._untracked_glib_glibmm_shell.cc.o.d -o glib/glibmm/libglibmm-2.68.so.1.3.0.p/.._.._untracked_glib_glibmm_shell.cc.o -c ../untracked/glib/glibmm/shell.cc In file included from ../untracked/glib/glibmm/shell.cc:4: In file included from ../glib/glibmm.h:104: In file included from ../untracked/glib/glibmm/binding.h:22: In file included from ../glib/glibmm/object.h:29: In file included from ../glib/glibmm/objectbase.h:22: In file included from ../glib/glibmm/signalproxy.h:27: /usr/local/include/sigc++-3.0/sigc++/sigc++.h:119:10: fatal error: 'sigc++/signal_connect.h' file not found 119 | #include | ^~~~~~~~~~~~~~~~~~~~~~~~~ 1 error generated. [ 6% 24/331] c++ -Iglib/glibmm/libglibmm-2.68.so.1.3.0.p -Iglib -I../glib -I../untracked/glib -I/usr/local/include/sigc++-3.0 -I/usr/local/lib/sigc++-3.0/include -I/usr/local/include/glib-2.0 -I/usr/local/lib/glib-2.0/include -I/usr/local/include -fdiagnostics-color=never -D_LIBCPP_HARDENING_MODE=_LIBCPP_HARDENING_MODE_FAST -D_FILE_OFFSET_BITS=64 -Wall -Winvalid-pch -std=c++17 -O2 -pipe -fstack-protector-strong -fno-strict-aliasing -fPIC -pthread -DGLIBMM_BUILD=1 -MD -MQ glib/glibmm/libglibmm-2.68.so.1.3.0.p/.._.._untracked_glib_glibmm_markup.cc.o -MF glib/glibmm/libglibmm-2.68.so.1.3.0.p/.._.._untracked_glib_glibmm_markup.cc.o.d -o glib/glibmm/libglibmm-2.68.so.1.3.0.p/.._.._untracked_glib_glibmm_markup.cc.o -c ../untracked/glib/glibmm/markup.cc FAILED: [code=1] glib/glibmm/libglibmm-2.68.so.1.3.0.p/.._.._untracked_glib_glibmm_markup.cc.o c++ -Iglib/glibmm/libglibmm-2.68.so.1.3.0.p -Iglib -I../glib -I../untracked/glib -I/usr/local/include/sigc++-3.0 -I/usr/local/lib/sigc++-3.0/include -I/usr/local/include/glib-2.0 -I/usr/local/lib/glib-2.0/include -I/usr/local/include -fdiagnostics-color=never -D_LIBCPP_HARDENING_MODE=_LIBCPP_HARDENING_MODE_FAST -D_FILE_OFFSET_BITS=64 -Wall -Winvalid-pch -std=c++17 -O2 -pipe -fstack-protector-strong -fno-strict-aliasing -fPIC -pthread -DGLIBMM_BUILD=1 -MD -MQ glib/glibmm/libglibmm-2.68.so.1.3.0.p/.._.._untracked_glib_glibmm_markup.cc.o -MF glib/glibmm/libglibmm-2.68.so.1.3.0.p/.._.._untracked_glib_glibmm_markup.cc.o.d -o glib/glibmm/libglibmm-2.68.so.1.3.0.p/.._.._untracked_glib_glibmm_markup.cc.o -c ../untracked/glib/glibmm/markup.cc In file included from ../untracked/glib/glibmm/markup.cc:4: In file included from ../glib/glibmm.h:104: In file included from ../untracked/glib/glibmm/binding.h:22: In file included from ../glib/glibmm/object.h:29: In file included from ../glib/glibmm/objectbase.h:22: In file included from ../glib/glibmm/signalproxy.h:27: /usr/local/include/sigc++-3.0/sigc++/sigc++.h:119:10: fatal error: 'sigc++/signal_connect.h' file not found 119 | #include | ^~~~~~~~~~~~~~~~~~~~~~~~~ 1 error generated. [ 6% 24/331] c++ -Iglib/glibmm/libglibmm-2.68.so.1.3.0.p -Iglib -I../glib -I../untracked/glib -I/usr/local/include/sigc++-3.0 -I/usr/local/lib/sigc++-3.0/include -I/usr/local/include/glib-2.0 -I/usr/local/lib/glib-2.0/include -I/usr/local/include -fdiagnostics-color=never -D_LIBCPP_HARDENING_MODE=_LIBCPP_HARDENING_MODE_FAST -D_FILE_OFFSET_BITS=64 -Wall -Winvalid-pch -std=c++17 -O2 -pipe -fstack-protector-strong -fno-strict-aliasing -fPIC -pthread -DGLIBMM_BUILD=1 -MD -MQ glib/glibmm/libglibmm-2.68.so.1.3.0.p/.._.._untracked_glib_glibmm_fileutils.cc.o -MF glib/glibmm/libglibmm-2.68.so.1.3.0.p/.._.._untracked_glib_glibmm_fileutils.cc.o.d -o glib/glibmm/libglibmm-2.68.so.1.3.0.p/.._.._untracked_glib_glibmm_fileutils.cc.o -c ../untracked/glib/glibmm/fileutils.cc FAILED: [code=1] glib/glibmm/libglibmm-2.68.so.1.3.0.p/.._.._untracked_glib_glibmm_fileutils.cc.o c++ -Iglib/glibmm/libglibmm-2.68.so.1.3.0.p -Iglib -I../glib -I../untracked/glib -I/usr/local/include/sigc++-3.0 -I/usr/local/lib/sigc++-3.0/include -I/usr/local/include/glib-2.0 -I/usr/local/lib/glib-2.0/include -I/usr/local/include -fdiagnostics-color=never -D_LIBCPP_HARDENING_MODE=_LIBCPP_HARDENING_MODE_FAST -D_FILE_OFFSET_BITS=64 -Wall -Winvalid-pch -std=c++17 -O2 -pipe -fstack-protector-strong -fno-strict-aliasing -fPIC -pthread -DGLIBMM_BUILD=1 -MD -MQ glib/glibmm/libglibmm-2.68.so.1.3.0.p/.._.._untracked_glib_glibmm_fileutils.cc.o -MF glib/glibmm/libglibmm-2.68.so.1.3.0.p/.._.._untracked_glib_glibmm_fileutils.cc.o.d -o glib/glibmm/libglibmm-2.68.so.1.3.0.p/.._.._untracked_glib_glibmm_fileutils.cc.o -c ../untracked/glib/glibmm/fileutils.cc In file included from ../untracked/glib/glibmm/fileutils.cc:4: In file included from ../glib/glibmm.h:104: In file included from ../untracked/glib/glibmm/binding.h:22: In file included from ../glib/glibmm/object.h:29: In file included from ../glib/glibmm/objectbase.h:22: In file included from ../glib/glibmm/signalproxy.h:27: /usr/local/include/sigc++-3.0/sigc++/sigc++.h:119:10: fatal error: 'sigc++/signal_connect.h' file not found 119 | #include | ^~~~~~~~~~~~~~~~~~~~~~~~~ 1 error generated. [ 6% 24/331] c++ -Iglib/glibmm/libglibmm-2.68.so.1.3.0.p -Iglib -I../glib -I../untracked/glib -I/usr/local/include/sigc++-3.0 -I/usr/local/lib/sigc++-3.0/include -I/usr/local/include/glib-2.0 -I/usr/local/lib/glib-2.0/include -I/usr/local/include -fdiagnostics-color=never -D_LIBCPP_HARDENING_MODE=_LIBCPP_HARDENING_MODE_FAST -D_FILE_OFFSET_BITS=64 -Wall -Winvalid-pch -std=c++17 -O2 -pipe -fstack-protector-strong -fno-strict-aliasing -fPIC -pthread -DGLIBMM_BUILD=1 -MD -MQ glib/glibmm/libglibmm-2.68.so.1.3.0.p/.._.._untracked_glib_glibmm_miscutils.cc.o -MF glib/glibmm/libglibmm-2.68.so.1.3.0.p/.._.._untracked_glib_glibmm_miscutils.cc.o.d -o glib/glibmm/libglibmm-2.68.so.1.3.0.p/.._.._untracked_glib_glibmm_miscutils.cc.o -c ../untracked/glib/glibmm/miscutils.cc FAILED: [code=1] glib/glibmm/libglibmm-2.68.so.1.3.0.p/.._.._untracked_glib_glibmm_miscutils.cc.o c++ -Iglib/glibmm/libglibmm-2.68.so.1.3.0.p -Iglib -I../glib -I../untracked/glib -I/usr/local/include/sigc++-3.0 -I/usr/local/lib/sigc++-3.0/include -I/usr/local/include/glib-2.0 -I/usr/local/lib/glib-2.0/include -I/usr/local/include -fdiagnostics-color=never -D_LIBCPP_HARDENING_MODE=_LIBCPP_HARDENING_MODE_FAST -D_FILE_OFFSET_BITS=64 -Wall -Winvalid-pch -std=c++17 -O2 -pipe -fstack-protector-strong -fno-strict-aliasing -fPIC -pthread -DGLIBMM_BUILD=1 -MD -MQ glib/glibmm/libglibmm-2.68.so.1.3.0.p/.._.._untracked_glib_glibmm_miscutils.cc.o -MF glib/glibmm/libglibmm-2.68.so.1.3.0.p/.._.._untracked_glib_glibmm_miscutils.cc.o.d -o glib/glibmm/libglibmm-2.68.so.1.3.0.p/.._.._untracked_glib_glibmm_miscutils.cc.o -c ../untracked/glib/glibmm/miscutils.cc In file included from ../untracked/glib/glibmm/miscutils.cc:4: In file included from ../glib/glibmm.h:104: In file included from ../untracked/glib/glibmm/binding.h:22: In file included from ../glib/glibmm/object.h:29: In file included from ../glib/glibmm/objectbase.h:22: In file included from ../glib/glibmm/signalproxy.h:27: /usr/local/include/sigc++-3.0/sigc++/sigc++.h:119:10: fatal error: 'sigc++/signal_connect.h' file not found 119 | #include | ^~~~~~~~~~~~~~~~~~~~~~~~~ 1 error generated. [ 6% 24/331] c++ -Iglib/glibmm/libglibmm-2.68.so.1.3.0.p -Iglib -I../glib -I../untracked/glib -I/usr/local/include/sigc++-3.0 -I/usr/local/lib/sigc++-3.0/include -I/usr/local/include/glib-2.0 -I/usr/local/lib/glib-2.0/include -I/usr/local/include -fdiagnostics-color=never -D_LIBCPP_HARDENING_MODE=_LIBCPP_HARDENING_MODE_FAST -D_FILE_OFFSET_BITS=64 -Wall -Winvalid-pch -std=c++17 -O2 -pipe -fstack-protector-strong -fno-strict-aliasing -fPIC -pthread -DGLIBMM_BUILD=1 -MD -MQ glib/glibmm/libglibmm-2.68.so.1.3.0.p/.._.._untracked_glib_glibmm_unicode.cc.o -MF glib/glibmm/libglibmm-2.68.so.1.3.0.p/.._.._untracked_glib_glibmm_unicode.cc.o.d -o glib/glibmm/libglibmm-2.68.so.1.3.0.p/.._.._untracked_glib_glibmm_unicode.cc.o -c ../untracked/glib/glibmm/unicode.cc FAILED: [code=1] glib/glibmm/libglibmm-2.68.so.1.3.0.p/.._.._untracked_glib_glibmm_unicode.cc.o c++ -Iglib/glibmm/libglibmm-2.68.so.1.3.0.p -Iglib -I../glib -I../untracked/glib -I/usr/local/include/sigc++-3.0 -I/usr/local/lib/sigc++-3.0/include -I/usr/local/include/glib-2.0 -I/usr/local/lib/glib-2.0/include -I/usr/local/include -fdiagnostics-color=never -D_LIBCPP_HARDENING_MODE=_LIBCPP_HARDENING_MODE_FAST -D_FILE_OFFSET_BITS=64 -Wall -Winvalid-pch -std=c++17 -O2 -pipe -fstack-protector-strong -fno-strict-aliasing -fPIC -pthread -DGLIBMM_BUILD=1 -MD -MQ glib/glibmm/libglibmm-2.68.so.1.3.0.p/.._.._untracked_glib_glibmm_unicode.cc.o -MF glib/glibmm/libglibmm-2.68.so.1.3.0.p/.._.._untracked_glib_glibmm_unicode.cc.o.d -o glib/glibmm/libglibmm-2.68.so.1.3.0.p/.._.._untracked_glib_glibmm_unicode.cc.o -c ../untracked/glib/glibmm/unicode.cc In file included from ../untracked/glib/glibmm/unicode.cc:4: In file included from ../glib/glibmm.h:104: In file included from ../untracked/glib/glibmm/binding.h:22: In file included from ../glib/glibmm/object.h:29: In file included from ../glib/glibmm/objectbase.h:22: In file included from ../glib/glibmm/signalproxy.h:27: /usr/local/include/sigc++-3.0/sigc++/sigc++.h:119:10: fatal error: 'sigc++/signal_connect.h' file not found 119 | #include | ^~~~~~~~~~~~~~~~~~~~~~~~~ 1 error generated. [ 7% 24/331] c++ -Iglib/glibmm/libglibmm-2.68.so.1.3.0.p -Iglib -I../glib -I../untracked/glib -I/usr/local/include/sigc++-3.0 -I/usr/local/lib/sigc++-3.0/include -I/usr/local/include/glib-2.0 -I/usr/local/lib/glib-2.0/include -I/usr/local/include -fdiagnostics-color=never -D_LIBCPP_HARDENING_MODE=_LIBCPP_HARDENING_MODE_FAST -D_FILE_OFFSET_BITS=64 -Wall -Winvalid-pch -std=c++17 -O2 -pipe -fstack-protector-strong -fno-strict-aliasing -fPIC -pthread -DGLIBMM_BUILD=1 -MD -MQ glib/glibmm/libglibmm-2.68.so.1.3.0.p/.._.._untracked_glib_glibmm_nodetree.cc.o -MF glib/glibmm/libglibmm-2.68.so.1.3.0.p/.._.._untracked_glib_glibmm_nodetree.cc.o.d -o glib/glibmm/libglibmm-2.68.so.1.3.0.p/.._.._untracked_glib_glibmm_nodetree.cc.o -c ../untracked/glib/glibmm/nodetree.cc FAILED: [code=1] glib/glibmm/libglibmm-2.68.so.1.3.0.p/.._.._untracked_glib_glibmm_nodetree.cc.o c++ -Iglib/glibmm/libglibmm-2.68.so.1.3.0.p -Iglib -I../glib -I../untracked/glib -I/usr/local/include/sigc++-3.0 -I/usr/local/lib/sigc++-3.0/include -I/usr/local/include/glib-2.0 -I/usr/local/lib/glib-2.0/include -I/usr/local/include -fdiagnostics-color=never -D_LIBCPP_HARDENING_MODE=_LIBCPP_HARDENING_MODE_FAST -D_FILE_OFFSET_BITS=64 -Wall -Winvalid-pch -std=c++17 -O2 -pipe -fstack-protector-strong -fno-strict-aliasing -fPIC -pthread -DGLIBMM_BUILD=1 -MD -MQ glib/glibmm/libglibmm-2.68.so.1.3.0.p/.._.._untracked_glib_glibmm_nodetree.cc.o -MF glib/glibmm/libglibmm-2.68.so.1.3.0.p/.._.._untracked_glib_glibmm_nodetree.cc.o.d -o glib/glibmm/libglibmm-2.68.so.1.3.0.p/.._.._untracked_glib_glibmm_nodetree.cc.o -c ../untracked/glib/glibmm/nodetree.cc In file included from ../untracked/glib/glibmm/nodetree.cc:4: In file included from ../glib/glibmm.h:104: In file included from ../untracked/glib/glibmm/binding.h:22: In file included from ../glib/glibmm/object.h:29: In file included from ../glib/glibmm/objectbase.h:22: In file included from ../glib/glibmm/signalproxy.h:27: /usr/local/include/sigc++-3.0/sigc++/sigc++.h:119:10: fatal error: 'sigc++/signal_connect.h' file not found 119 | #include | ^~~~~~~~~~~~~~~~~~~~~~~~~ 1 error generated. ninja: build stopped: subcommand failed. ===> Compilation failed unexpectedly. Try to set MAKE_JOBS_UNSAFE=yes and rebuild before reporting the failure to the maintainer. *** Error code 1 Stop. make: stopped in /usr/mports/devel/glibmm26
Links
Depends On
- devel/gettext-runtime (build)
- devel/gettext-tools (build)
- devel/meson (build)
- devel/ninja (build)
- devel/pkgconf (build)
- lang/perl5.40 (build)
- lang/python311 (build)
- lang/python312 (build)
- devel/gettext-runtime (lib)
- devel/glib20 (lib)
- devel/libsigc++30 (lib)
- lang/perl5.40 (run)
Depend Of
- sysutils/gnome-system-monitor
- accessibility/atkmm26
- x11-toolkits/gtkmm40
- deskutils/gnote
- net-im/telegram-desktop
- x11-toolkits/pangomm24
- audio/pavucontrol
Categories
CVEs
- Loading CVE information...
MidnightBSD Magus