MidnightBSD Magus

net/uhttpmock

HTTP web service mocking library for GNOME

Flavor Version Run OSVersion Arch License Restricted Status
0.5.1 432 2.0 i386 lgpl2.1 0 fail

Events

Machine Type Time Message
m2032 info 2020-11-27 11:29:31.330447 Test Started
m2032 fail 2020-11-27 11:30:27.566196 make build returned non-zero: 1
m2032 fail 2020-11-27 11:30:27.616122 Test complete.

Log

===>  Building for uhttpmock-0.5.1
gmake[1]: Entering directory '/magus/work/usr/mports/net/uhttpmock/work/uhttpmock-0.5.1'
gmake  all-recursive
gmake[2]: Entering directory '/magus/work/usr/mports/net/uhttpmock/work/uhttpmock-0.5.1'
Making all in .
gmake[3]: Entering directory '/magus/work/usr/mports/net/uhttpmock/work/uhttpmock-0.5.1'
for pkg in libxml-2.0 libsoup-2.4 gio-2.0; do \
	echo $pkg >> libuhttpmock/libuhttpmock-0.0.deps; \
done
/bin/sh ./libtool  --tag=CC   --mode=compile cc -DHAVE_CONFIG_H -I.  -I. -I./libuhttpmock -I./libuhttpmock -DG_LOG_DOMAIN=\"libuhttpmock\"     -I/usr/local/include -I/usr/local/include/glib-2.0 -I/usr/local/lib/glib-2.0/include -I/usr/local/lib/libffi-3.2.1/include -I/usr/local/include/libsoup-2.4 -pthread -I/usr/local/include/libxml2   -fno-strict-aliasing -Wall -Wextra -Wundef -Wnested-externs -Wwrite-strings -Wpointer-arith -Wmissing-declarations -Wmissing-prototypes -Wstrict-prototypes -Wredundant-decls -Wno-unused-parameter -Wno-missing-field-initializers -Wdeclaration-after-statement -Wformat=2 -Wold-style-definition -Wcast-align -Wformat-nonliteral -Wformat-security -Wsign-compare -Wstrict-aliasing -Wshadow -Winline -Wpacked -Wmissing-format-attribute -Wmissing-noreturn -Winit-self -Wmissing-include-dirs -Warray-bounds -Wimplicit-function-declaration -Wreturn-type -Wswitch-enum -Wswitch-default -Wno-error=unused-parameter -Wno-error=missing-field-initializers   -O2 -pipe -fno-strict-aliasing -MT libuhttpmock/libuhttpmock_libuhttpmock_0.0_la-uhm-resolver.lo -MD -MP -MF libuhttpmock/.deps/libuhttpmock_libuhttpmock_0.0_la-uhm-resolver.Tpo -c -o libuhttpmock/libuhttpmock_libuhttpmock_0.0_la-uhm-resolver.lo `test -f 'libuhttpmock/uhm-resolver.c' || echo './'`libuhttpmock/uhm-resolver.c
/bin/sh ./libtool  --tag=CC   --mode=compile cc -DHAVE_CONFIG_H -I.  -I. -I./libuhttpmock -I./libuhttpmock -DG_LOG_DOMAIN=\"libuhttpmock\"     -I/usr/local/include -I/usr/local/include/glib-2.0 -I/usr/local/lib/glib-2.0/include -I/usr/local/lib/libffi-3.2.1/include -I/usr/local/include/libsoup-2.4 -pthread -I/usr/local/include/libxml2   -fno-strict-aliasing -Wall -Wextra -Wundef -Wnested-externs -Wwrite-strings -Wpointer-arith -Wmissing-declarations -Wmissing-prototypes -Wstrict-prototypes -Wredundant-decls -Wno-unused-parameter -Wno-missing-field-initializers -Wdeclaration-after-statement -Wformat=2 -Wold-style-definition -Wcast-align -Wformat-nonliteral -Wformat-security -Wsign-compare -Wstrict-aliasing -Wshadow -Winline -Wpacked -Wmissing-format-attribute -Wmissing-noreturn -Winit-self -Wmissing-include-dirs -Warray-bounds -Wimplicit-function-declaration -Wreturn-type -Wswitch-enum -Wswitch-default -Wno-error=unused-parameter -Wno-error=missing-field-initializers   -O2 -pipe -fno-strict-aliasing -MT libuhttpmock/libuhttpmock_libuhttpmock_0.0_la-uhm-server.lo -MD -MP -MF libuhttpmock/.deps/libuhttpmock_libuhttpmock_0.0_la-uhm-server.Tpo -c -o libuhttpmock/libuhttpmock_libuhttpmock_0.0_la-uhm-server.lo `test -f 'libuhttpmock/uhm-server.c' || echo './'`libuhttpmock/uhm-server.c
libtool: compile:  cc -DHAVE_CONFIG_H -I. -I. -I./libuhttpmock -I./libuhttpmock -DG_LOG_DOMAIN=\"libuhttpmock\" -I/usr/local/include -I/usr/local/include/glib-2.0 -I/usr/local/lib/glib-2.0/include -I/usr/local/lib/libffi-3.2.1/include -I/usr/local/include/libsoup-2.4 -pthread -I/usr/local/include/libxml2 -fno-strict-aliasing -Wall -Wextra -Wundef -Wnested-externs -Wwrite-strings -Wpointer-arith -Wmissing-declarations -Wmissing-prototypes -Wstrict-prototypes -Wredundant-decls -Wno-unused-parameter -Wno-missing-field-initializers -Wdeclaration-after-statement -Wformat=2 -Wold-style-definition -Wcast-align -Wformat-nonliteral -Wformat-security -Wsign-compare -Wstrict-aliasing -Wshadow -Winline -Wpacked -Wmissing-format-attribute -Wmissing-noreturn -Winit-self -Wmissing-include-dirs -Warray-bounds -Wimplicit-function-declaration -Wreturn-type -Wswitch-enum -Wswitch-default -Wno-error=unused-parameter -Wno-error=missing-field-initializers -O2 -pipe -fno-strict-aliasing -MT libuhttpmock/libuhttpmock_libuhttpmock_0.0_la-uhm-resolver.lo -MD -MP -MF libuhttpmock/.deps/libuhttpmock_libuhttpmock_0.0_la-uhm-resolver.Tpo -c libuhttpmock/uhm-resolver.c  -fPIC -DPIC -o libuhttpmock/.libs/libuhttpmock_libuhttpmock_0.0_la-uhm-resolver.o
libtool: compile:  cc -DHAVE_CONFIG_H -I. -I. -I./libuhttpmock -I./libuhttpmock -DG_LOG_DOMAIN=\"libuhttpmock\" -I/usr/local/include -I/usr/local/include/glib-2.0 -I/usr/local/lib/glib-2.0/include -I/usr/local/lib/libffi-3.2.1/include -I/usr/local/include/libsoup-2.4 -pthread -I/usr/local/include/libxml2 -fno-strict-aliasing -Wall -Wextra -Wundef -Wnested-externs -Wwrite-strings -Wpointer-arith -Wmissing-declarations -Wmissing-prototypes -Wstrict-prototypes -Wredundant-decls -Wno-unused-parameter -Wno-missing-field-initializers -Wdeclaration-after-statement -Wformat=2 -Wold-style-definition -Wcast-align -Wformat-nonliteral -Wformat-security -Wsign-compare -Wstrict-aliasing -Wshadow -Winline -Wpacked -Wmissing-format-attribute -Wmissing-noreturn -Winit-self -Wmissing-include-dirs -Warray-bounds -Wimplicit-function-declaration -Wreturn-type -Wswitch-enum -Wswitch-default -Wno-error=unused-parameter -Wno-error=missing-field-initializers -O2 -pipe -fno-strict-aliasing -MT libuhttpmock/libuhttpmock_libuhttpmock_0.0_la-uhm-server.lo -MD -MP -MF libuhttpmock/.deps/libuhttpmock_libuhttpmock_0.0_la-uhm-server.Tpo -c libuhttpmock/uhm-server.c  -fPIC -DPIC -o libuhttpmock/.libs/libuhttpmock_libuhttpmock_0.0_la-uhm-server.o
libuhttpmock/uhm-resolver.c:87:2: warning: 'g_type_class_add_private' is deprecated [-Wdeprecated-declarations]
        g_type_class_add_private (klass, sizeof (UhmResolverPrivate));
        ^
/usr/local/include/glib-2.0/gobject/gtype.h:1303:1: note: 'g_type_class_add_private' has been explicitly marked deprecated here
GLIB_DEPRECATED_IN_2_58
^
/usr/local/include/glib-2.0/glib/gversionmacros.h:850:49: note: expanded from macro 'GLIB_DEPRECATED_IN_2_58'
# define GLIB_DEPRECATED_IN_2_58                GLIB_DEPRECATED
                                                ^
/usr/local/include/glib-2.0/glib/gmacros.h:983:25: note: expanded from macro 'GLIB_DEPRECATED'
#define GLIB_DEPRECATED G_DEPRECATED _GLIB_EXTERN
                        ^
/usr/local/include/glib-2.0/glib/gmacros.h:944:37: note: expanded from macro 'G_DEPRECATED'
#define G_DEPRECATED __attribute__((__deprecated__))
                                    ^
libuhttpmock/uhm-resolver.c:102:15: warning: Deprecated pre-processor symbol, replace with G_ADD_PRIVATE [-W#pragma-messages]
        self->priv = G_TYPE_INSTANCE_GET_PRIVATE (self, UHM_TYPE_RESOLVER, UhmResolverPrivate);
                     ^
/usr/local/include/glib-2.0/gobject/gtype.h:643:145: note: expanded from macro 'G_TYPE_INSTANCE_GET_PRIVATE'
#define G_TYPE_INSTANCE_GET_PRIVATE(instance, g_type, c_type)   ((c_type*) g_type_instance_get_private ((GTypeInstance*) (instance), (g_type))) GLIB_DEPRECATED_MACRO_IN_2_58_FOR(G_ADD_PRIVATE)
                                                                                                                                                ^
/usr/local/include/glib-2.0/glib/gversionmacros.h:853:49: note: expanded from macro 'GLIB_DEPRECATED_MACRO_IN_2_58_FOR'
# define GLIB_DEPRECATED_MACRO_IN_2_58_FOR(f)   GLIB_DEPRECATED_MACRO_FOR(f)
                                                ^
/usr/local/include/glib-2.0/glib/gmacros.h:994:38: note: expanded from macro 'GLIB_DEPRECATED_MACRO_FOR'
#define GLIB_DEPRECATED_MACRO_FOR(f) _GLIB_GNUC_DO_PRAGMA(GCC warning "Deprecated pre-processor symbol, replace with " #f)
                                     ^
/usr/local/include/glib-2.0/glib/gmacros.h:992:33: note: expanded from macro '_GLIB_GNUC_DO_PRAGMA'
#define _GLIB_GNUC_DO_PRAGMA(x) _Pragma(G_STRINGIFY (x))
                                ^
:35:6: note: expanded from here
 GCC warning "Deprecated pre-processor symbol, replace with " "G_ADD_PRIVATE"
     ^
libuhttpmock/uhm-server.c:162:2: warning: 'g_type_class_add_private' is deprecated [-Wdeprecated-declarations]
        g_type_class_add_private (klass, sizeof (UhmServerPrivate));
        ^
/usr/local/include/glib-2.0/gobject/gtype.h:1303:1: note: 'g_type_class_add_private' has been explicitly marked deprecated here
GLIB_DEPRECATED_IN_2_58
^
/usr/local/include/glib-2.0/glib/gversionmacros.h:850:49: note: expanded from macro 'GLIB_DEPRECATED_IN_2_58'
# define GLIB_DEPRECATED_IN_2_58                GLIB_DEPRECATED
                                                ^
/usr/local/include/glib-2.0/glib/gmacros.h:983:25: note: expanded from macro 'GLIB_DEPRECATED'
#define GLIB_DEPRECATED G_DEPRECATED _GLIB_EXTERN
                        ^
/usr/local/include/glib-2.0/glib/gmacros.h:944:37: note: expanded from macro 'G_DEPRECATED'
#define G_DEPRECATED __attribute__((__deprecated__))
                                    ^
libuhttpmock/uhm-server.c:338:15: warning: Deprecated pre-processor symbol, replace with G_ADD_PRIVATE [-W#pragma-messages]
        self->priv = G_TYPE_INSTANCE_GET_PRIVATE (self, UHM_TYPE_SERVER, UhmServerPrivate);
                     ^
/usr/local/include/glib-2.0/gobject/gtype.h:643:145: note: expanded from macro 'G_TYPE_INSTANCE_GET_PRIVATE'
#define G_TYPE_INSTANCE_GET_PRIVATE(instance, g_type, c_type)   ((c_type*) g_type_instance_get_private ((GTypeInstance*) (instance), (g_type))) GLIB_DEPRECATED_MACRO_IN_2_58_FOR(G_ADD_PRIVATE)
                                                                                                                                                ^
/usr/local/include/glib-2.0/glib/gversionmacros.h:853:49: note: expanded from macro 'GLIB_DEPRECATED_MACRO_IN_2_58_FOR'
# define GLIB_DEPRECATED_MACRO_IN_2_58_FOR(f)   GLIB_DEPRECATED_MACRO_FOR(f)
                                                ^
/usr/local/include/glib-2.0/glib/gmacros.h:994:38: note: expanded from macro 'GLIB_DEPRECATED_MACRO_FOR'
#define GLIB_DEPRECATED_MACRO_FOR(f) _GLIB_GNUC_DO_PRAGMA(GCC warning "Deprecated pre-processor symbol, replace with " #f)
                                     ^
/usr/local/include/glib-2.0/glib/gmacros.h:992:33: note: expanded from macro '_GLIB_GNUC_DO_PRAGMA'
#define _GLIB_GNUC_DO_PRAGMA(x) _Pragma(G_STRINGIFY (x))
                                ^
:41:6: note: expanded from here
 GCC warning "Deprecated pre-processor symbol, replace with " "G_ADD_PRIVATE"
     ^
2 warnings generated.
libtool: compile:  cc -DHAVE_CONFIG_H -I. -I. -I./libuhttpmock -I./libuhttpmock -DG_LOG_DOMAIN=\"libuhttpmock\" -I/usr/local/include -I/usr/local/include/glib-2.0 -I/usr/local/lib/glib-2.0/include -I/usr/local/lib/libffi-3.2.1/include -I/usr/local/include/libsoup-2.4 -pthread -I/usr/local/include/libxml2 -fno-strict-aliasing -Wall -Wextra -Wundef -Wnested-externs -Wwrite-strings -Wpointer-arith -Wmissing-declarations -Wmissing-prototypes -Wstrict-prototypes -Wredundant-decls -Wno-unused-parameter -Wno-missing-field-initializers -Wdeclaration-after-statement -Wformat=2 -Wold-style-definition -Wcast-align -Wformat-nonliteral -Wformat-security -Wsign-compare -Wstrict-aliasing -Wshadow -Winline -Wpacked -Wmissing-format-attribute -Wmissing-noreturn -Winit-self -Wmissing-include-dirs -Warray-bounds -Wimplicit-function-declaration -Wreturn-type -Wswitch-enum -Wswitch-default -Wno-error=unused-parameter -Wno-error=missing-field-initializers -O2 -pipe -fno-strict-aliasing -MT libuhttpmock/libuhttpmock_libuhttpmock_0.0_la-uhm-resolver.lo -MD -MP -MF libuhttpmock/.deps/libuhttpmock_libuhttpmock_0.0_la-uhm-resolver.Tpo -c libuhttpmock/uhm-resolver.c -o libuhttpmock/libuhttpmock_libuhttpmock_0.0_la-uhm-resolver.o >/dev/null 2>&1
mv -f libuhttpmock/.deps/libuhttpmock_libuhttpmock_0.0_la-uhm-resolver.Tpo libuhttpmock/.deps/libuhttpmock_libuhttpmock_0.0_la-uhm-resolver.Plo
2 warnings generated.
libtool: compile:  cc -DHAVE_CONFIG_H -I. -I. -I./libuhttpmock -I./libuhttpmock -DG_LOG_DOMAIN=\"libuhttpmock\" -I/usr/local/include -I/usr/local/include/glib-2.0 -I/usr/local/lib/glib-2.0/include -I/usr/local/lib/libffi-3.2.1/include -I/usr/local/include/libsoup-2.4 -pthread -I/usr/local/include/libxml2 -fno-strict-aliasing -Wall -Wextra -Wundef -Wnested-externs -Wwrite-strings -Wpointer-arith -Wmissing-declarations -Wmissing-prototypes -Wstrict-prototypes -Wredundant-decls -Wno-unused-parameter -Wno-missing-field-initializers -Wdeclaration-after-statement -Wformat=2 -Wold-style-definition -Wcast-align -Wformat-nonliteral -Wformat-security -Wsign-compare -Wstrict-aliasing -Wshadow -Winline -Wpacked -Wmissing-format-attribute -Wmissing-noreturn -Winit-self -Wmissing-include-dirs -Warray-bounds -Wimplicit-function-declaration -Wreturn-type -Wswitch-enum -Wswitch-default -Wno-error=unused-parameter -Wno-error=missing-field-initializers -O2 -pipe -fno-strict-aliasing -MT libuhttpmock/libuhttpmock_libuhttpmock_0.0_la-uhm-server.lo -MD -MP -MF libuhttpmock/.deps/libuhttpmock_libuhttpmock_0.0_la-uhm-server.Tpo -c libuhttpmock/uhm-server.c -o libuhttpmock/libuhttpmock_libuhttpmock_0.0_la-uhm-server.o >/dev/null 2>&1
mv -f libuhttpmock/.deps/libuhttpmock_libuhttpmock_0.0_la-uhm-server.Tpo libuhttpmock/.deps/libuhttpmock_libuhttpmock_0.0_la-uhm-server.Plo
/bin/sh ./libtool  --tag=CC   --mode=link cc -I/usr/local/include -I/usr/local/include/glib-2.0 -I/usr/local/lib/glib-2.0/include -I/usr/local/lib/libffi-3.2.1/include -I/usr/local/include/libsoup-2.4 -pthread -I/usr/local/include/libxml2   -fno-strict-aliasing -Wall -Wextra -Wundef -Wnested-externs -Wwrite-strings -Wpointer-arith -Wmissing-declarations -Wmissing-prototypes -Wstrict-prototypes -Wredundant-decls -Wno-unused-parameter -Wno-missing-field-initializers -Wdeclaration-after-statement -Wformat=2 -Wold-style-definition -Wcast-align -Wformat-nonliteral -Wformat-security -Wsign-compare -Wstrict-aliasing -Wshadow -Winline -Wpacked -Wmissing-format-attribute -Wmissing-noreturn -Winit-self -Wmissing-include-dirs -Warray-bounds -Wimplicit-function-declaration -Wreturn-type -Wswitch-enum -Wswitch-default -Wno-error=unused-parameter -Wno-error=missing-field-initializers   -O2 -pipe -fno-strict-aliasing -Wl,--no-as-needed -version-info 2:1:2 -export-symbols ./libuhttpmock/libuhttpmock.symbols -no-undefined    -o libuhttpmock/libuhttpmock-0.0.la -rpath /usr/local/lib  libuhttpmock/libuhttpmock_libuhttpmock_0.0_la-uhm-resolver.lo libuhttpmock/libuhttpmock_libuhttpmock_0.0_la-uhm-server.lo -L/usr/local/lib -lsoup-2.4 -lgio-2.0 -lgobject-2.0 -lglib-2.0 -lintl     
libtool: link: echo "{ global:" > libuhttpmock/.libs/libuhttpmock-0.0.so.0.2.1-ver
libtool: link: 		 sed -e "s|$|;|" < ./libuhttpmock/libuhttpmock.symbols >> libuhttpmock/.libs/libuhttpmock-0.0.so.0.2.1-ver
libtool: link: 	 echo "local: *; };" >> libuhttpmock/.libs/libuhttpmock-0.0.so.0.2.1-ver
libtool: link: cc -shared  -fPIC -DPIC  libuhttpmock/.libs/libuhttpmock_libuhttpmock_0.0_la-uhm-resolver.o libuhttpmock/.libs/libuhttpmock_libuhttpmock_0.0_la-uhm-server.o   -L/usr/local/lib -lsoup-2.4 -lgio-2.0 -lgobject-2.0 -lglib-2.0 -lintl  -pthread -O2 -Wl,--no-as-needed   -pthread -Wl,-soname -Wl,libuhttpmock-0.0.so.0 -Wl,-version-script -Wl,libuhttpmock/.libs/libuhttpmock-0.0.so.0.2.1-ver -o libuhttpmock/.libs/libuhttpmock-0.0.so.0.2.1
libtool: link: (cd "libuhttpmock/.libs" && rm -f "libuhttpmock-0.0.so.0" && ln -s "libuhttpmock-0.0.so.0.2.1" "libuhttpmock-0.0.so.0")
libtool: link: (cd "libuhttpmock/.libs" && rm -f "libuhttpmock-0.0.so" && ln -s "libuhttpmock-0.0.so.0.2.1" "libuhttpmock-0.0.so")
libtool: link: ar cru libuhttpmock/.libs/libuhttpmock-0.0.a  libuhttpmock/libuhttpmock_libuhttpmock_0.0_la-uhm-resolver.o libuhttpmock/libuhttpmock_libuhttpmock_0.0_la-uhm-server.o
libtool: link: ranlib libuhttpmock/.libs/libuhttpmock-0.0.a
libtool: link: ( cd "libuhttpmock/.libs" && rm -f "libuhttpmock-0.0.la" && ln -s "../libuhttpmock-0.0.la" "libuhttpmock-0.0.la" )
CPPFLAGS="" CFLAGS="-O2 -pipe -fno-strict-aliasing" LDFLAGS="" CC="cc" PKG_CONFIG="pkgconf" GI_HOST_OS="" DLLTOOL="false"  /usr/local/bin/g-ir-scanner  --warn-all --namespace=Uhm --nsversion=0.0 --libtool="/bin/sh ./libtool"  --include=GObject-2.0 --include=Soup-2.4 --pkg-export=libuhttpmock   --library=libuhttpmock/libuhttpmock-0.0.la --nsversion=0.0 --symbol-prefix=uhm --c-include="uhttpmock/uhm.h" --cflags-begin -I/usr/local/include -I/usr/local/include/glib-2.0 -I/usr/local/lib/glib-2.0/include -I/usr/local/lib/libffi-3.2.1/include -I/usr/local/include/libsoup-2.4 -pthread -I/usr/local/include/libxml2  -I. -I./libuhttpmock -I./libuhttpmock -DG_LOG_DOMAIN=\"libuhttpmock\"     --cflags-end  libuhttpmock/uhm-resolver.c libuhttpmock/uhm-server.c libuhttpmock/uhm-resolver.h libuhttpmock/uhm-server.h libuhttpmock/uhm-version.h libuhttpmock/libuhttpmock-0.0.la --output libuhttpmock/Uhm-0.0.gir
g-ir-scanner: link: /bin/sh ./libtool --mode=link --tag=CC cc -o /magus/work/usr/mports/net/uhttpmock/work/uhttpmock-0.5.1/tmp-introspect_1gpq11x/Uhm-0.0 -export-dynamic -O2 -pipe -fno-strict-aliasing /magus/work/usr/mports/net/uhttpmock/work/uhttpmock-0.5.1/tmp-introspect_1gpq11x/Uhm-0.0.o -L. libuhttpmock/libuhttpmock-0.0.la -L/usr/local/lib -lgio-2.0 -lgobject-2.0 -Wl,--export-dynamic -lgmodule-2.0 -pthread -lglib-2.0 -lglib-2.0 -lintl
libtool: link: cc -o /magus/work/usr/mports/net/uhttpmock/work/uhttpmock-0.5.1/tmp-introspect_1gpq11x/.libs/Uhm-0.0 -O2 -pipe -fno-strict-aliasing /magus/work/usr/mports/net/uhttpmock/work/uhttpmock-0.5.1/tmp-introspect_1gpq11x/Uhm-0.0.o -Wl,--export-dynamic -pthread -Wl,--export-dynamic  -L. libuhttpmock/.libs/libuhttpmock-0.0.so -L/usr/local/lib -lgmodule-2.0 -lsoup-2.4 -lgio-2.0 -lgobject-2.0 -lglib-2.0 -lintl -pthread -Wl,-rpath -Wl,/usr/local/lib
/usr/local/bin/g-ir-compiler  --includedir=. libuhttpmock/Uhm-0.0.gir -o libuhttpmock/Uhm-0.0.typelib
/usr/local/bin/vapigen-0.40  --library libuhttpmock/libuhttpmock-0.0 --metadatadir ./libuhttpmock   --pkg libxml-2.0 --pkg libsoup-2.4 --pkg gio-2.0 libuhttpmock/Uhm-0.0.gir
Uhm-0.0.gir:1441.5-1441.29: error: unknown child element `docsection' in `namespace'
    
    ^^^^^^^^^^^^^^^^^^^^^^^^^
Uhm-0.0.gir:1447.5-1447.25: error: unknown child element `docsection' in `namespace'
    
    ^^^^^^^^^^^^^^^^^^^^^
Uhm-0.0.gir:1469.5-1469.27: error: unknown child element `docsection' in `namespace'
    
    ^^^^^^^^^^^^^^^^^^^^^^^
Generation failed: 3 error(s), 0 warning(s)
gmake[3]: *** [/usr/local/share/vala/Makefile.vapigen:61: libuhttpmock/libuhttpmock-0.0.vapi] Error 1
gmake[3]: *** Waiting for unfinished jobs....
gmake[3]: Leaving directory '/magus/work/usr/mports/net/uhttpmock/work/uhttpmock-0.5.1'
gmake[2]: *** [Makefile:882: all-recursive] Error 1
gmake[2]: Leaving directory '/magus/work/usr/mports/net/uhttpmock/work/uhttpmock-0.5.1'
gmake[1]: *** [Makefile:606: all] Error 2
gmake[1]: Leaving directory '/magus/work/usr/mports/net/uhttpmock/work/uhttpmock-0.5.1'
===> Compilation failed unexpectedly.
Try to set MAKE_JOBS_UNSAFE=yes and rebuild before reporting the failure to
the maintainer.
*** Error code 1

Stop.
make: stopped in /usr/mports/net/uhttpmock